BDBM50209024 CHEMBL3884986
SMILES: OC(=O)CCCNCc1cc2cccc(-c3cccc4ccccc34)c2s1
InChI Key: InChIKey=VUBNMHBIPDCZDK-UHFFFAOYSA-N
Data: 2 EC50
Activity Spreadsheet -- Enzyme Inhibition Constant Data from BindingDB
Found 2 hits for monomerid = 50209024
Trg + Lig
Ki
nM
ΔG°
kcal/mole
IC50
nM
Kd
nM
EC50/IC50
nM
koff
s-1
kon
M-1s-1
pHTemp
°C
Sphingosine 1-phosphate receptor 4
(Homo sapiens (Human))
BDBM50209024
(CHEMBL3884986)
Show SMILES OC(=O)CCCNCc1cc2cccc(-c3cccc4ccccc34)c2s1
Show InChI InChI=1S/C23H21NO2S/c25-22(26)12-5-13-24-15-18-14-17-8-4-11-21(23(17)27-18)20-10-3-7-16-6-1-2-9-19(16)20/h1-4,6-11,14,24H,5,12-13,15H2,(H,25,26)
NCI pathway
Reactome pathway
n/an/an/an/a 1.98E+3n/an/an/an/a
Harvard Medical School
Curated by ChEMBL
Assay Description
Agonist activity at recombinant human S1PR4 expressed in CHO cell membranes assessed as [35S]GTP-gammaS binding measured after 1.5 hrs by TopCount sc...
Bioorg Med Chem Lett 27: 1-5 (2017)
Article DOI: 10.1016/j.bmcl.2016.11.050
BindingDB Entry DOI: 10.7270/Q241702R
Sphingosine 1-phosphate receptor 5
(Homo sapiens (Human))
BDBM50209024
(CHEMBL3884986)
Show SMILES OC(=O)CCCNCc1cc2cccc(-c3cccc4ccccc34)c2s1
Show InChI InChI=1S/C23H21NO2S/c25-22(26)12-5-13-24-15-18-14-17-8-4-11-21(23(17)27-18)20-10-3-7-16-6-1-2-9-19(16)20/h1-4,6-11,14,24H,5,12-13,15H2,(H,25,26)
NCI pathway
Reactome pathway
n/an/an/an/a 2.32E+3n/an/an/an/a
Harvard Medical School
Curated by ChEMBL
Assay Description
Agonist activity at recombinant human S1PR5 expressed in CHO cell membranes assessed as [35S]GTP-gammaS binding measured after 1.5 hrs by TopCount sc...
Bioorg Med Chem Lett 27: 1-5 (2017)
Article DOI: 10.1016/j.bmcl.2016.11.050
BindingDB Entry DOI: 10.7270/Q241702R