BDBM50209055 CHEMBL3884995
SMILES: CC(CNCc1cc2cc(ccc2s1)-c1ccc2ccccc2c1)C(O)=O
InChI Key: InChIKey=PAIIIKVRFZNHMW-UHFFFAOYSA-N
Data: 2 EC50
Activity Spreadsheet -- Enzyme Inhibition Constant Data from BindingDB
Found 2 hits for monomerid = 50209055
Trg + Lig
Ki
nM
ΔG°
kcal/mole
IC50
nM
Kd
nM
EC50/IC50
nM
koff
s-1
kon
M-1s-1
pHTemp
°C
Sphingosine 1-phosphate receptor 4
(Homo sapiens (Human))
BDBM50209055
(CHEMBL3884995)
Show SMILES CC(CNCc1cc2cc(ccc2s1)-c1ccc2ccccc2c1)C(O)=O
Show InChI InChI=1S/C23H21NO2S/c1-15(23(25)26)13-24-14-21-12-20-11-19(8-9-22(20)27-21)18-7-6-16-4-2-3-5-17(16)10-18/h2-12,15,24H,13-14H2,1H3,(H,25,26)
NCI pathway
Reactome pathway
n/an/an/an/a 115n/an/an/an/a
Harvard Medical School
Curated by ChEMBL
Assay Description
Agonist activity at recombinant human S1PR4 expressed in CHO cell membranes assessed as [35S]GTP-gammaS binding measured after 1.5 hrs by TopCount sc...
Bioorg Med Chem Lett 27: 1-5 (2017)
Article DOI: 10.1016/j.bmcl.2016.11.050
BindingDB Entry DOI: 10.7270/Q241702R
Sphingosine 1-phosphate receptor 5
(Homo sapiens (Human))
BDBM50209055
(CHEMBL3884995)
Show SMILES CC(CNCc1cc2cc(ccc2s1)-c1ccc2ccccc2c1)C(O)=O
Show InChI InChI=1S/C23H21NO2S/c1-15(23(25)26)13-24-14-21-12-20-11-19(8-9-22(20)27-21)18-7-6-16-4-2-3-5-17(16)10-18/h2-12,15,24H,13-14H2,1H3,(H,25,26)
NCI pathway
Reactome pathway
n/an/an/an/a 232n/an/an/an/a
Harvard Medical School
Curated by ChEMBL
Assay Description
Agonist activity at recombinant human S1PR5 expressed in CHO cell membranes assessed as [35S]GTP-gammaS binding measured after 1.5 hrs by TopCount sc...
Bioorg Med Chem Lett 27: 1-5 (2017)
Article DOI: 10.1016/j.bmcl.2016.11.050
BindingDB Entry DOI: 10.7270/Q241702R