BDBM50209067 CHEMBL3883621
SMILES: OC(=O)CCCCNCc1cc2cc(ccc2s1)-c1ccc2ccccc2c1
InChI Key: InChIKey=BAJHFEOPASJFRJ-UHFFFAOYSA-N
Data: 2 EC50
Activity Spreadsheet -- Enzyme Inhibition Constant Data from BindingDB
Found 2 hits for monomerid = 50209067
Trg + Lig
Ki
nM
ΔG°
kcal/mole
IC50
nM
Kd
nM
EC50/IC50
nM
koff
s-1
kon
M-1s-1
pHTemp
°C
Sphingosine 1-phosphate receptor 5
(Homo sapiens (Human))
BDBM50209067
(CHEMBL3883621)
Show SMILES OC(=O)CCCCNCc1cc2cc(ccc2s1)-c1ccc2ccccc2c1
Show InChI InChI=1S/C24H23NO2S/c26-24(27)7-3-4-12-25-16-22-15-21-14-20(10-11-23(21)28-22)19-9-8-17-5-1-2-6-18(17)13-19/h1-2,5-6,8-11,13-15,25H,3-4,7,12,16H2,(H,26,27)
NCI pathway
Reactome pathway
n/an/an/an/a 709n/an/an/an/a
Harvard Medical School
Curated by ChEMBL
Assay Description
Agonist activity at recombinant human S1PR5 expressed in CHO cell membranes assessed as [35S]GTP-gammaS binding measured after 1.5 hrs by TopCount sc...
Bioorg Med Chem Lett 27: 1-5 (2017)
Article DOI: 10.1016/j.bmcl.2016.11.050
BindingDB Entry DOI: 10.7270/Q241702R
Sphingosine 1-phosphate receptor 4
(Homo sapiens (Human))
BDBM50209067
(CHEMBL3883621)
Show SMILES OC(=O)CCCCNCc1cc2cc(ccc2s1)-c1ccc2ccccc2c1
Show InChI InChI=1S/C24H23NO2S/c26-24(27)7-3-4-12-25-16-22-15-21-14-20(10-11-23(21)28-22)19-9-8-17-5-1-2-6-18(17)13-19/h1-2,5-6,8-11,13-15,25H,3-4,7,12,16H2,(H,26,27)
NCI pathway
Reactome pathway
n/an/an/an/a 724n/an/an/an/a
Harvard Medical School
Curated by ChEMBL
Assay Description
Agonist activity at recombinant human S1PR4 expressed in CHO cell membranes assessed as [35S]GTP-gammaS binding measured after 1.5 hrs by TopCount sc...
Bioorg Med Chem Lett 27: 1-5 (2017)
Article DOI: 10.1016/j.bmcl.2016.11.050
BindingDB Entry DOI: 10.7270/Q241702R