BDBM50209108 CHEMBL3884532
SMILES: FC(F)(F)c1c(O[C@H]2CC[C@@H](CC2)c2ccccc2)ccn2c(CC3CC3)nnc12
InChI Key: InChIKey=PFJJRBBDPVGGQD-IYARVYRRSA-N
Data: 1 EC50
Activity Spreadsheet -- Enzyme Inhibition Constant Data from BindingDB
Found 1 hit for monomerid = 50209108
Trg + Lig
Ki
nM
ΔG°
kcal/mole
IC50
nM
Kd
nM
EC50/IC50
nM
koff
s-1
kon
M-1s-1
pHTemp
°C
Metabotropic glutamate receptor 2
(Homo sapiens (Human))
BDBM50209108
(CHEMBL3884532)
Show SMILES FC(F)(F)c1c(O[C@H]2CC[C@@H](CC2)c2ccccc2)ccn2c(CC3CC3)nnc12 |r,wU:10.13,wD:7.6,(11.67,-8.41,;12.88,-9.12,;12.63,-7.53,;11.37,-9.68,;14.21,-9.9,;14.21,-11.43,;12.87,-12.19,;12.86,-13.73,;11.51,-14.49,;11.5,-16.02,;12.82,-16.8,;14.16,-16.05,;14.18,-14.5,;12.8,-18.34,;11.46,-19.09,;11.44,-20.62,;12.77,-21.41,;14.11,-20.65,;14.12,-19.11,;15.54,-12.21,;16.87,-11.44,;16.88,-9.91,;18.02,-8.88,;19.53,-9.21,;20.62,-8.12,;21.02,-6.65,;22.11,-7.73,;17.41,-7.48,;15.88,-7.63,;15.55,-9.14,)|
Show InChI InChI=1S/C23H24F3N3O/c24-23(25,26)21-19(12-13-29-20(14-15-6-7-15)27-28-22(21)29)30-18-10-8-17(9-11-18)16-4-2-1-3-5-16/h1-5,12-13,15,17-18H,6-11,14H2/t17-,18-
n/an/an/an/a 0.400n/an/an/an/a
Bristol-Myers Squibb
Curated by ChEMBL
Assay Description
Positive allosteric modulation of human mGlu2 receptor expressed in HEK293 cells coexpressing rat glutamate transporter assessed as inhibition of for...
Bioorg Med Chem 25: 496-513 (2017)
Article DOI: 10.1016/j.bmc.2016.11.018
BindingDB Entry DOI: 10.7270/Q2QR504D