BDBM50209166 3-(4-(dimethylamino)cyclohex-1-enyl)-1H-indole-5-carbonitrile::CHEMBL390432
SMILES: CN(C)C1CCC(=CC1)c1c[nH]c2ccc(cc12)C#N
InChI Key: InChIKey=RSNYUBDIPFPZKJ-UHFFFAOYSA-N
Data: 4 IC50
Activity Spreadsheet -- Enzyme Inhibition Constant Data from BindingDB
Found 4 hits for monomerid = 50209166
Trg + Lig
Ki
nM
ΔG°
kcal/mole
IC50
nM
Kd
nM
EC50/IC50
nM
koff
s-1
kon
M-1s-1
pHTemp
°C
Sodium-dependent serotonin transporter
(Homo sapiens (Human))
BDBM50209166
(3-(4-(dimethylamino)cyclohex-1-enyl)-1H-indole-5-c...)
Show SMILES CN(C)C1CCC(=CC1)c1c[nH]c2ccc(cc12)C#N |w:3.2,c:6|
Show InChI InChI=1S/C17H19N3/c1-20(2)14-6-4-13(5-7-14)16-11-19-17-8-3-12(10-18)9-15(16)17/h3-4,8-9,11,14,19H,5-7H2,1-2H3
n/an/a 0.340n/an/an/an/an/an/a
Bristol-Myers Squibb Pharmaceutical Research Institute
Curated by ChEMBL
Assay Description
Displacement of [125I]RTI-55 from human SERT expressed in HEK293 cells
Bioorg Med Chem Lett 17: 3099-104 (2007)
Article DOI: 10.1016/j.bmcl.2007.03.040
BindingDB Entry DOI: 10.7270/Q2QN66F8
Sodium-dependent noradrenaline transporter
(Homo sapiens (Human))
BDBM50209166
(3-(4-(dimethylamino)cyclohex-1-enyl)-1H-indole-5-c...)
Show SMILES CN(C)C1CCC(=CC1)c1c[nH]c2ccc(cc12)C#N |w:3.2,c:6|
Show InChI InChI=1S/C17H19N3/c1-20(2)14-6-4-13(5-7-14)16-11-19-17-8-3-12(10-18)9-15(16)17/h3-4,8-9,11,14,19H,5-7H2,1-2H3
Reactome pathway
n/an/a 57n/an/an/an/an/an/a
Bristol-Myers Squibb Pharmaceutical Research Institute
Curated by ChEMBL
Assay Description
Displacement of [125I]Nisoxetine from human NET expressed in HEK293 cells
Bioorg Med Chem Lett 17: 3099-104 (2007)
Article DOI: 10.1016/j.bmcl.2007.03.040
BindingDB Entry DOI: 10.7270/Q2QN66F8
Sodium-dependent serotonin transporter
(Homo sapiens (Human))
BDBM50209166
(3-(4-(dimethylamino)cyclohex-1-enyl)-1H-indole-5-c...)
Show SMILES CN(C)C1CCC(=CC1)c1c[nH]c2ccc(cc12)C#N |w:3.2,c:6|
Show InChI InChI=1S/C17H19N3/c1-20(2)14-6-4-13(5-7-14)16-11-19-17-8-3-12(10-18)9-15(16)17/h3-4,8-9,11,14,19H,5-7H2,1-2H3
n/an/a 1.60n/an/an/an/an/an/a
Bristol-Myers Squibb Pharmaceutical Research Institute
Curated by ChEMBL
Assay Description
Displacement of [3H]citalopram from human SERT expressed in HEK293 cells
Bioorg Med Chem Lett 17: 3099-104 (2007)
Article DOI: 10.1016/j.bmcl.2007.03.040
BindingDB Entry DOI: 10.7270/Q2QN66F8
Sodium-dependent dopamine transporter
(Homo sapiens (Human))
BDBM50209166
(3-(4-(dimethylamino)cyclohex-1-enyl)-1H-indole-5-c...)
Show SMILES CN(C)C1CCC(=CC1)c1c[nH]c2ccc(cc12)C#N |w:3.2,c:6|
Show InChI InChI=1S/C17H19N3/c1-20(2)14-6-4-13(5-7-14)16-11-19-17-8-3-12(10-18)9-15(16)17/h3-4,8-9,11,14,19H,5-7H2,1-2H3
NCI pathway
Reactome pathway
n/an/a 97n/an/an/an/an/an/a
Bristol-Myers Squibb Pharmaceutical Research Institute
Curated by ChEMBL
Assay Description
Displacement of [125I]RTI-55 from human DAT expressed in HEK293 cells
Bioorg Med Chem Lett 17: 3099-104 (2007)
Article DOI: 10.1016/j.bmcl.2007.03.040
BindingDB Entry DOI: 10.7270/Q2QN66F8