BDBM50209241 4-bromo-1H-indazole::CHEMBL246393
SMILES: Brc1cccc2[nH]ncc12
InChI Key: InChIKey=KJIODOACRIRBPB-UHFFFAOYSA-N
Data: 2 IC50
Activity Spreadsheet -- Enzyme Inhibition Constant Data from BindingDB
Found 2 hits for monomerid = 50209241
Trg + Lig
Ki
nM
ΔG°
kcal/mole
IC50
nM
Kd
nM
EC50/IC50
nM
koff
s-1
kon
M-1s-1
pHTemp
°C
Nitric oxide synthase, brain
(Homo sapiens (Human))
BDBM50209241
(4-bromo-1H-indazole | CHEMBL246393)
Show SMILES Brc1cccc2[nH]ncc12
Show InChI InChI=1S/C7H5BrN2/c8-6-2-1-3-7-5(6)4-9-10-7/h1-4H,(H,9,10)
Reactome pathway
n/an/a 2.40E+3n/an/an/an/an/an/a
UNED
Curated by ChEMBL
Assay Description
Inhibition of NOS1
Bioorg Med Chem 17: 6180-7 (2009)
Article DOI: 10.1016/j.bmc.2009.07.067
BindingDB Entry DOI: 10.7270/Q2ZG6SBD
Nitric-oxide synthase, brain
(Rattus norvegicus (rat))
BDBM50209241
(4-bromo-1H-indazole | CHEMBL246393)
Show SMILES Brc1cccc2[nH]ncc12
Show InChI InChI=1S/C7H5BrN2/c8-6-2-1-3-7-5(6)4-9-10-7/h1-4H,(H,9,10)
n/an/a 2.40E+3n/an/an/an/an/an/a
UPRES-EA 3915
Curated by ChEMBL
Assay Description
Inhibition of rat neuronal NOS
Bioorg Med Chem Lett 17: 3177-80 (2007)
Article DOI: 10.1016/j.bmcl.2007.03.024
BindingDB Entry DOI: 10.7270/Q2Z60NR3