BDBM50209461 (3S)-3-(3-bromo-5-chloro-2-hydroxyphenyl)-3-(2-(3-(5-hydroxy-1,4,5,6-tetrahydropyrimidin-2-ylamino)nicotinamido)acetamido)propanoic acid::CHEMBL244434
SMILES: [#8]-[#6]-1-[#6]-[#7]\[#6](-[#7]-[#6]-1)=[#7]\c1cncc(c1)-[#6](=O)-[#7]-[#6]-[#6](=O)-[#7]-[#6@@H](-[#6]-[#6](-[#8])=O)-c1cc(Cl)cc(Br)c1-[#8]
InChI Key: InChIKey=IJCLIKANGQOCLK-INIZCTEOSA-N
Data: 8 IC50
Activity Spreadsheet -- Enzyme Inhibition Constant Data from BindingDB
Found 8 hits for monomerid = 50209461
Trg + Lig
Ki
nM
ΔG°
kcal/mole
IC50
nM
Kd
nM
EC50/IC50
nM
koff
s-1
kon
M-1s-1
pHTemp
°C
Integrin alpha-V/beta-3
(Homo sapiens (Human))
BDBM50209461
((3S)-3-(3-bromo-5-chloro-2-hydroxyphenyl)-3-(2-(3-...)
Show SMILES [#8]-[#6]-1-[#6]-[#7]\[#6](-[#7]-[#6]-1)=[#7]\c1cncc(c1)-[#6](=O)-[#7]-[#6]-[#6](=O)-[#7]-[#6@@H](-[#6]-[#6](-[#8])=O)-c1cc(Cl)cc(Br)c1-[#8]
Show InChI InChI=1S/C21H22BrClN6O6/c22-15-3-11(23)2-14(19(15)34)16(4-18(32)33)29-17(31)9-25-20(35)10-1-12(6-24-5-10)28-21-26-7-13(30)8-27-21/h1-3,5-6,13,16,30,34H,4,7-9H2,(H,25,35)(H,29,31)(H,32,33)(H2,26,27,28)/t16-/m0/s1
n/an/a 0.400n/an/an/an/an/an/a
Pfizer Global Research and Development
Curated by ChEMBL
Assay Description
Inhibition of alphaVbeta3 integrin receptor expressed in human 293 cells
Bioorg Med Chem 15: 3783-800 (2007)
Article DOI: 10.1016/j.bmc.2007.03.034
BindingDB Entry DOI: 10.7270/Q25Q4VR4
Integrin alpha-V/beta-6
(Homo sapiens (Human))
BDBM50209461
((3S)-3-(3-bromo-5-chloro-2-hydroxyphenyl)-3-(2-(3-...)
Show SMILES [#8]-[#6]-1-[#6]-[#7]\[#6](-[#7]-[#6]-1)=[#7]\c1cncc(c1)-[#6](=O)-[#7]-[#6]-[#6](=O)-[#7]-[#6@@H](-[#6]-[#6](-[#8])=O)-c1cc(Cl)cc(Br)c1-[#8]
Show InChI InChI=1S/C21H22BrClN6O6/c22-15-3-11(23)2-14(19(15)34)16(4-18(32)33)29-17(31)9-25-20(35)10-1-12(6-24-5-10)28-21-26-7-13(30)8-27-21/h1-3,5-6,13,16,30,34H,4,7-9H2,(H,25,35)(H,29,31)(H,32,33)(H2,26,27,28)/t16-/m0/s1
n/an/a 1.10n/an/an/an/an/an/a
University of Bradford
Curated by ChEMBL
Assay Description
Antagonist activity at alphavbeta6 integrin receptor in human HT29 cells after 4 hrs using p-nitrophenyl phosphate by colorimetry
J Med Chem 57: 6301-15 (2014)
Article DOI: 10.1021/jm5000547
BindingDB Entry DOI: 10.7270/Q2NS0XW8
Integrin alpha-V/beta-1
(Homo sapiens (Human))
BDBM50209461
((3S)-3-(3-bromo-5-chloro-2-hydroxyphenyl)-3-(2-(3-...)
Show SMILES [#8]-[#6]-1-[#6]-[#7]\[#6](-[#7]-[#6]-1)=[#7]\c1cncc(c1)-[#6](=O)-[#7]-[#6]-[#6](=O)-[#7]-[#6@@H](-[#6]-[#6](-[#8])=O)-c1cc(Cl)cc(Br)c1-[#8]
Show InChI InChI=1S/C21H22BrClN6O6/c22-15-3-11(23)2-14(19(15)34)16(4-18(32)33)29-17(31)9-25-20(35)10-1-12(6-24-5-10)28-21-26-7-13(30)8-27-21/h1-3,5-6,13,16,30,34H,4,7-9H2,(H,25,35)(H,29,31)(H,32,33)(H2,26,27,28)/t16-/m0/s1
n/an/a 1.60n/an/an/an/an/an/a
University of Bradford
Curated by ChEMBL
Assay Description
Antagonist activity at alphavbeta1 integrin receptor in HEK293 cells after 4 hrs using p-nitrophenyl phosphate by colorimetry
J Med Chem 57: 6301-15 (2014)
Article DOI: 10.1021/jm5000547
BindingDB Entry DOI: 10.7270/Q2NS0XW8
Integrin alpha-V/beta-8
(Homo sapiens (Human))
BDBM50209461
((3S)-3-(3-bromo-5-chloro-2-hydroxyphenyl)-3-(2-(3-...)
Show SMILES [#8]-[#6]-1-[#6]-[#7]\[#6](-[#7]-[#6]-1)=[#7]\c1cncc(c1)-[#6](=O)-[#7]-[#6]-[#6](=O)-[#7]-[#6@@H](-[#6]-[#6](-[#8])=O)-c1cc(Cl)cc(Br)c1-[#8]
Show InChI InChI=1S/C21H22BrClN6O6/c22-15-3-11(23)2-14(19(15)34)16(4-18(32)33)29-17(31)9-25-20(35)10-1-12(6-24-5-10)28-21-26-7-13(30)8-27-21/h1-3,5-6,13,16,30,34H,4,7-9H2,(H,25,35)(H,29,31)(H,32,33)(H2,26,27,28)/t16-/m0/s1
n/an/a 0.650n/an/an/an/an/an/a
University of Bradford
Curated by ChEMBL
Assay Description
Antagonist activity at human recombinant alphavbeta8 integrin receptor expressed in HEK293 cells after 4 hrs using p-nitrophenyl phosphate by colorim...
J Med Chem 57: 6301-15 (2014)
Article DOI: 10.1021/jm5000547
BindingDB Entry DOI: 10.7270/Q2NS0XW8
Integrin alpha-5/beta-1
(Homo sapiens (Human))
BDBM50209461
((3S)-3-(3-bromo-5-chloro-2-hydroxyphenyl)-3-(2-(3-...)
Show SMILES [#8]-[#6]-1-[#6]-[#7]\[#6](-[#7]-[#6]-1)=[#7]\c1cncc(c1)-[#6](=O)-[#7]-[#6]-[#6](=O)-[#7]-[#6@@H](-[#6]-[#6](-[#8])=O)-c1cc(Cl)cc(Br)c1-[#8]
Show InChI InChI=1S/C21H22BrClN6O6/c22-15-3-11(23)2-14(19(15)34)16(4-18(32)33)29-17(31)9-25-20(35)10-1-12(6-24-5-10)28-21-26-7-13(30)8-27-21/h1-3,5-6,13,16,30,34H,4,7-9H2,(H,25,35)(H,29,31)(H,32,33)(H2,26,27,28)/t16-/m0/s1
n/an/a 64n/an/an/an/an/an/a
University of Bradford
Curated by ChEMBL
Assay Description
Antagonist activity at alpha5beta1 integrin receptor in K562 cells after 4 hrs using p-nitrophenyl phosphate by colorimetry
J Med Chem 57: 6301-15 (2014)
Article DOI: 10.1021/jm5000547
BindingDB Entry DOI: 10.7270/Q2NS0XW8
Integrin alpha-IIb/beta-3
(Homo sapiens (Human))
BDBM50209461
((3S)-3-(3-bromo-5-chloro-2-hydroxyphenyl)-3-(2-(3-...)
Show SMILES [#8]-[#6]-1-[#6]-[#7]\[#6](-[#7]-[#6]-1)=[#7]\c1cncc(c1)-[#6](=O)-[#7]-[#6]-[#6](=O)-[#7]-[#6@@H](-[#6]-[#6](-[#8])=O)-c1cc(Cl)cc(Br)c1-[#8]
Show InChI InChI=1S/C21H22BrClN6O6/c22-15-3-11(23)2-14(19(15)34)16(4-18(32)33)29-17(31)9-25-20(35)10-1-12(6-24-5-10)28-21-26-7-13(30)8-27-21/h1-3,5-6,13,16,30,34H,4,7-9H2,(H,25,35)(H,29,31)(H,32,33)(H2,26,27,28)/t16-/m0/s1
n/an/a 380n/an/an/an/an/an/a
University of Bradford
Curated by ChEMBL
Assay Description
Antagonist activity at alpha2bbeta3 integrin receptor (unknown origin) by cell-free ELISA
J Med Chem 57: 6301-15 (2014)
Article DOI: 10.1021/jm5000547
BindingDB Entry DOI: 10.7270/Q2NS0XW8
Integrin alpha-5/alpha-V
(Homo sapiens (Human))
BDBM50209461
((3S)-3-(3-bromo-5-chloro-2-hydroxyphenyl)-3-(2-(3-...)
Show SMILES [#8]-[#6]-1-[#6]-[#7]\[#6](-[#7]-[#6]-1)=[#7]\c1cncc(c1)-[#6](=O)-[#7]-[#6]-[#6](=O)-[#7]-[#6@@H](-[#6]-[#6](-[#8])=O)-c1cc(Cl)cc(Br)c1-[#8]
Show InChI InChI=1S/C21H22BrClN6O6/c22-15-3-11(23)2-14(19(15)34)16(4-18(32)33)29-17(31)9-25-20(35)10-1-12(6-24-5-10)28-21-26-7-13(30)8-27-21/h1-3,5-6,13,16,30,34H,4,7-9H2,(H,25,35)(H,29,31)(H,32,33)(H2,26,27,28)/t16-/m0/s1
n/an/a 1.5n/an/an/an/an/an/a
University of Bradford
Curated by ChEMBL
Assay Description
Antagonist activity at alphavbeta5 integrin receptor in HEK293 cells after 4 hrs using p-nitrophenyl phosphate by colorimetry
J Med Chem 57: 6301-15 (2014)
Article DOI: 10.1021/jm5000547
BindingDB Entry DOI: 10.7270/Q2NS0XW8
Integrin alpha-V/beta-3
(Homo sapiens (Human))
BDBM50209461
((3S)-3-(3-bromo-5-chloro-2-hydroxyphenyl)-3-(2-(3-...)
Show SMILES [#8]-[#6]-1-[#6]-[#7]\[#6](-[#7]-[#6]-1)=[#7]\c1cncc(c1)-[#6](=O)-[#7]-[#6]-[#6](=O)-[#7]-[#6@@H](-[#6]-[#6](-[#8])=O)-c1cc(Cl)cc(Br)c1-[#8]
Show InChI InChI=1S/C21H22BrClN6O6/c22-15-3-11(23)2-14(19(15)34)16(4-18(32)33)29-17(31)9-25-20(35)10-1-12(6-24-5-10)28-21-26-7-13(30)8-27-21/h1-3,5-6,13,16,30,34H,4,7-9H2,(H,25,35)(H,29,31)(H,32,33)(H2,26,27,28)/t16-/m0/s1
n/an/a 0.400n/an/an/an/an/an/a
University of Bradford
Curated by ChEMBL
Assay Description
Antagonist activity at alphavbeta3 integrin receptor in HEK293 cells after 4 hrs using p-nitrophenyl phosphate by colorimetry
J Med Chem 57: 6301-15 (2014)
Article DOI: 10.1021/jm5000547
BindingDB Entry DOI: 10.7270/Q2NS0XW8