null
SMILES: [#6]-c1cc(Cl)cc(-[#6@H](-[#6]-[#6](-[#8])=O)-[#7]-[#6](=O)-[#6]-[#7]-[#6](=O)-c2cc(-[#8])cc(c2)\[#7]=[#6]-2\[#7]-[#6]-[#6](-[#8])-[#6]-[#7]-2)c1-[#8]
InChI Key: InChIKey=GXRKFNQFQYXRHQ-SFHVURJKSA-N
Activity Spreadsheet -- Enzyme Inhibition Constant Data from BindingDB
Found 1 hit for monomerid = 50209482
Trg + Lig
Ki
nM
ΔG°
kcal/mole
IC50
nM
Kd
nM
EC50/IC50
nM
koff
s-1
kon
M-1s-1
pHTemp
°C
Integrin alpha-V/beta-3
(Homo sapiens (Human))
BDBM50209482
((3S)-3-(5-chloro-2-hydroxy-3-methylphenyl)-3-(2-(3...)
Show SMILES [#6]-c1cc(Cl)cc(-[#6@H](-[#6]-[#6](-[#8])=O)-[#7]-[#6](=O)-[#6]-[#7]-[#6](=O)-c2cc(-[#8])cc(c2)\[#7]=[#6]-2\[#7]-[#6]-[#6](-[#8])-[#6]-[#7]-2)c1-[#8]
Show InChI InChI=1S/C23H26ClN5O7/c1-11-2-13(24)5-17(21(11)35)18(7-20(33)34)29-19(32)10-25-22(36)12-3-14(6-15(30)4-12)28-23-26-8-16(31)9-27-23/h2-6,16,18,30-31,35H,7-10H2,1H3,(H,25,36)(H,29,32)(H,33,34)(H2,26,27,28)/t18-/m0/s1
n/an/a 0.200n/an/an/an/an/an/a
Pfizer Global Research and Development
Curated by ChEMBL
Assay Description
Inhibition of alphaVbeta3 integrin receptor expressed in human 293 cells
Bioorg Med Chem 15: 3783-800 (2007)
Article DOI: 10.1016/j.bmc.2007.03.034
BindingDB Entry DOI: 10.7270/Q25Q4VR4