BDBM50209504 CHEMBL3884692
SMILES: CN(\N=C\c1cnn2ccc(cc12)C#N)S(=O)(=O)c1cc(ccc1NCc1ccccn1)[N+]([O-])=O
InChI Key: InChIKey=QIGFDKVDGDNYSS-LGJNPRDNSA-N
Data: 2 IC50
Activity Spreadsheet -- Enzyme Inhibition Constant Data from BindingDB
Found 2 hits for monomerid = 50209504
Trg + Lig
Ki
nM
ΔG°
kcal/mole
IC50
nM
Kd
nM
EC50/IC50
nM
koff
s-1
kon
M-1s-1
pHTemp
°C
Phosphatidylinositol 4,5-bisphosphate 3-kinase catalytic subunit delta isoform
(Homo sapiens (Human))
BDBM50209504
(CHEMBL3884692)
Show SMILES CN(\N=C\c1cnn2ccc(cc12)C#N)S(=O)(=O)c1cc(ccc1NCc1ccccn1)[N+]([O-])=O
Show InChI InChI=1S/C22H18N8O4S/c1-28(26-13-17-14-27-29-9-7-16(12-23)10-21(17)29)35(33,34)22-11-19(30(31)32)5-6-20(22)25-15-18-4-2-3-8-24-18/h2-11,13-14,25H,15H2,1H3/b26-13+
NCI pathway
Reactome pathway
n/an/a 350n/an/an/an/an/an/a
University of Auckland
Curated by ChEMBL
Assay Description
Inhibition of p110delta (unknown origin) using L-alpha phosphatidylinositol as substrate after 1 hr in presence of [gamma33]-ATP by thin layer chroma...
Bioorg Med Chem Lett 27: 187-190 (2017)
Article DOI: 10.1016/j.bmcl.2016.11.078
BindingDB Entry DOI: 10.7270/Q2BG2R0D
p110β/p85α
(Homo sapiens (Human))
BDBM50209504
(CHEMBL3884692)
Show SMILES CN(\N=C\c1cnn2ccc(cc12)C#N)S(=O)(=O)c1cc(ccc1NCc1ccccn1)[N+]([O-])=O
Show InChI InChI=1S/C22H18N8O4S/c1-28(26-13-17-14-27-29-9-7-16(12-23)10-21(17)29)35(33,34)22-11-19(30(31)32)5-6-20(22)25-15-18-4-2-3-8-24-18/h2-11,13-14,25H,15H2,1H3/b26-13+
n/an/a>1.00E+3n/an/an/an/an/an/a
University of Auckland
Curated by ChEMBL
Assay Description
Inhibition of recombinant human p110beta/N-terminal His-tagged human p85alpha expressed in baculovirus infected sf cells using L-alpha-phosphatidylin...
Bioorg Med Chem Lett 27: 187-190 (2017)
Article DOI: 10.1016/j.bmcl.2016.11.078
BindingDB Entry DOI: 10.7270/Q2BG2R0D