BDBM50209526 3-[3-cyano-2-(2'-ethoxy-biphenyl-4-yl)-6-fluoro-quinolin-4-ylamino]-propionic acid::CHEMBL245592
SMILES: CCOc1ccccc1-c1ccc(cc1)-c1nc2ccc(F)cc2c(NCCC(O)=O)c1C#N
InChI Key: InChIKey=KLJOAWKZRANTLD-UHFFFAOYSA-N
Data: 1 IC50
Activity Spreadsheet -- Enzyme Inhibition Constant Data from BindingDB
Found 1 hit for monomerid = 50209526
Trg + Lig
Ki
nM
ΔG°
kcal/mole
IC50
nM
Kd
nM
EC50/IC50
nM
koff
s-1
kon
M-1s-1
pHTemp
°C
cAMP and cAMP-inhibited cGMP 3',5'-cyclic phosphodiesterase 10A
(Homo sapiens (Human))
BDBM50209526
(3-[3-cyano-2-(2'-ethoxy-biphenyl-4-yl)-6-fluoro-qu...)
Show SMILES CCOc1ccccc1-c1ccc(cc1)-c1nc2ccc(F)cc2c(NCCC(O)=O)c1C#N
Show InChI InChI=1S/C27H22FN3O3/c1-2-34-24-6-4-3-5-20(24)17-7-9-18(10-8-17)26-22(16-29)27(30-14-13-25(32)33)21-15-19(28)11-12-23(21)31-26/h3-12,15H,2,13-14H2,1H3,(H,30,31)(H,32,33)
Reactome pathway
n/an/a 2n/an/an/an/an/an/a
Bayer Pharmaceuticals Corporation
Curated by ChEMBL
Assay Description
Inhibition of human recombinant PDE10A transfected in insect Sf9 cells by scintillation proximity assay
Bioorg Med Chem Lett 17: 2869-73 (2007)
Article DOI: 10.1016/j.bmcl.2007.02.061
BindingDB Entry DOI: 10.7270/Q2NS0TK0