BDBM50209610 CHEMBL3884910
SMILES: CN(Cc1ccccn1)c1ccc(cc1S(=O)(=O)N\N=C(/C)c1cnn2ccc(Br)cc12)[N+]([O-])=O
InChI Key: InChIKey=ATMXKSOXUDBGFO-CVKSISIWSA-N
Data: 2 IC50
Activity Spreadsheet -- Enzyme Inhibition Constant Data from BindingDB
Found 2 hits for monomerid = 50209610
Trg + Lig
Ki
nM
ΔG°
kcal/mole
IC50
nM
Kd
nM
EC50/IC50
nM
koff
s-1
kon
M-1s-1
pHTemp
°C
p110β/p85α
(Homo sapiens (Human))
BDBM50209610
(CHEMBL3884910)
Show SMILES CN(Cc1ccccn1)c1ccc(cc1S(=O)(=O)N\N=C(/C)c1cnn2ccc(Br)cc12)[N+]([O-])=O
Show InChI InChI=1S/C22H20BrN7O4S/c1-15(19-13-25-29-10-8-16(23)11-21(19)29)26-27-35(33,34)22-12-18(30(31)32)6-7-20(22)28(2)14-17-5-3-4-9-24-17/h3-13,27H,14H2,1-2H3/b26-15+
n/an/a 5.60E+3n/an/an/an/an/an/a
University of Auckland
Curated by ChEMBL
Assay Description
Inhibition of recombinant human p110beta/N-terminal His-tagged human p85alpha expressed in baculovirus infected sf cells using L-alpha-phosphatidylin...
Bioorg Med Chem Lett 27: 187-190 (2017)
Article DOI: 10.1016/j.bmcl.2016.11.078
BindingDB Entry DOI: 10.7270/Q2BG2R0D
Phosphatidylinositol 4,5-bisphosphate 3-kinase catalytic subunit delta isoform
(Homo sapiens (Human))
BDBM50209610
(CHEMBL3884910)
Show SMILES CN(Cc1ccccn1)c1ccc(cc1S(=O)(=O)N\N=C(/C)c1cnn2ccc(Br)cc12)[N+]([O-])=O
Show InChI InChI=1S/C22H20BrN7O4S/c1-15(19-13-25-29-10-8-16(23)11-21(19)29)26-27-35(33,34)22-12-18(30(31)32)6-7-20(22)28(2)14-17-5-3-4-9-24-17/h3-13,27H,14H2,1-2H3/b26-15+
NCI pathway
Reactome pathway
n/an/a 292n/an/an/an/an/an/a
University of Auckland
Curated by ChEMBL
Assay Description
Inhibition of p110delta (unknown origin) using L-alpha phosphatidylinositol as substrate after 1 hr in presence of [gamma33]-ATP by thin layer chroma...
Bioorg Med Chem Lett 27: 187-190 (2017)
Article DOI: 10.1016/j.bmcl.2016.11.078
BindingDB Entry DOI: 10.7270/Q2BG2R0D