BDBM50209764 CHEMBL3884776
SMILES: O[C@H]1COc2cc(F)c(F)c(Nc3ccc(I)cc3F)c2NS(=O)(=O)C2(CC2)C[C@H]1O
InChI Key: InChIKey=FENWEVRRFMFDBS-KGLIPLIRSA-N
Data: 1 IC50
Activity Spreadsheet -- Enzyme Inhibition Constant Data from BindingDB
Found 1 hit for monomerid = 50209764
Trg + Lig
Ki
nM
ΔG°
kcal/mole
IC50
nM
Kd
nM
EC50/IC50
nM
koff
s-1
kon
M-1s-1
pHTemp
°C
Dual specificity mitogen-activated protein kinase kinase 1
(Homo sapiens (Human))
BDBM50209764
(CHEMBL3884776)
Show SMILES O[C@H]1COc2cc(F)c(F)c(Nc3ccc(I)cc3F)c2NS(=O)(=O)C2(CC2)C[C@H]1O |r|
Show InChI InChI=1S/C19H18F3IN2O5S/c20-10-5-9(23)1-2-12(10)24-18-16(22)11(21)6-15-17(18)25-31(28,29)19(3-4-19)7-13(26)14(27)8-30-15/h1-2,5-6,13-14,24-27H,3-4,7-8H2/t13-,14+/m1/s1
Reactome pathway
n/an/a 21n/an/an/an/an/an/a
Columbia University
Curated by ChEMBL
Assay Description
Inhibition of full length human GST-tagged MEK1 using ERK1/ERK2 peptide substrate in presence of ATP by ADP-Glo chemiluminescence assay
Bioorg Med Chem 25: 1004-1013 (2017)
Article DOI: 10.1016/j.bmc.2016.12.014
BindingDB Entry DOI: 10.7270/Q2TH8PPH