null
SMILES: C[C@@H](N)Cc1c2CCOc2c(CCc2nc(C)no2)c2CCOc12
InChI Key: InChIKey=SNUHFSRRAHQKDD-SNVBAGLBSA-N
Activity Spreadsheet -- Enzyme Inhibition Constant Data from BindingDB
Found 2 hits for monomerid = 50210088
Trg + Lig
Ki
nM
ΔG°
kcal/mole
IC50
nM
Kd
nM
EC50/IC50
nM
koff
s-1
kon
M-1s-1
pHTemp
°C
5-hydroxytryptamine receptor 2A
(Rattus norvegicus (rat))
BDBM50210088
((R)-1-methyl-2-{8-[2-(3-methyl-[1,2,4]oxadiazol-5-...)
Show SMILES C[C@@H](N)Cc1c2CCOc2c(CCc2nc(C)no2)c2CCOc12
Show InChI InChI=1S/C18H23N3O3/c1-10(19)9-15-14-6-8-22-17(14)12(13-5-7-23-18(13)15)3-4-16-20-11(2)21-24-16/h10H,3-9,19H2,1-2H3/t10-/m1/s1
Reactome pathway
n/an/an/an/a>1.00E+4n/an/an/an/a
Alcon Research, Ltd
Curated by ChEMBL
Assay Description
Agonist activity at 5HT2A receptor in rat A7r5 cells assessed as intracellular calcium mobilization relative to 5HT
Bioorg Med Chem Lett 17: 2998-3002 (2007)
Article DOI: 10.1016/j.bmcl.2007.03.073
BindingDB Entry DOI: 10.7270/Q2KS6R7B
5-hydroxytryptamine receptor 2A
(Rattus norvegicus (rat))
BDBM50210088
((R)-1-methyl-2-{8-[2-(3-methyl-[1,2,4]oxadiazol-5-...)
Show SMILES C[C@@H](N)Cc1c2CCOc2c(CCc2nc(C)no2)c2CCOc12
Show InChI InChI=1S/C18H23N3O3/c1-10(19)9-15-14-6-8-22-17(14)12(13-5-7-23-18(13)15)3-4-16-20-11(2)21-24-16/h10H,3-9,19H2,1-2H3/t10-/m1/s1
Reactome pathway
n/an/a 1n/an/an/an/an/an/a
Alcon Research, Ltd
Curated by ChEMBL
Assay Description
Displacement of [125I]DOI from 5HT2A receptor in rat cerebral cortex
Bioorg Med Chem Lett 17: 2998-3002 (2007)
Article DOI: 10.1016/j.bmcl.2007.03.073
BindingDB Entry DOI: 10.7270/Q2KS6R7B