BDBM50210299 6-(2-(4-methylpiperazin-1-yl)ethyl)-3-(5-(3-phenoxyprop-1-ynyl)thiophen-3-yl)-1,4-dihydroindeno[1,2-c]pyrazole::CHEMBL390353
SMILES: CN1CCN(CCc2ccc-3c(Cc4c-3n[nH]c4-c3csc(c3)C#CCOc3ccccc3)c2)CC1
InChI Key: InChIKey=XJODRXDUZDKWPQ-UHFFFAOYSA-N
Data: 3 IC50
Activity Spreadsheet -- Enzyme Inhibition Constant Data from BindingDB
Found 3 hits for monomerid = 50210299
Trg + Lig
Ki
nM
ΔG°
kcal/mole
IC50
nM
Kd
nM
EC50/IC50
nM
koff
s-1
kon
M-1s-1
pHTemp
°C
Vascular endothelial growth factor receptor 2
(Homo sapiens (Human))
BDBM50210299
(6-(2-(4-methylpiperazin-1-yl)ethyl)-3-(5-(3-phenox...)
Show SMILES CN1CCN(CCc2ccc-3c(Cc4c-3n[nH]c4-c3csc(c3)C#CCOc3ccccc3)c2)CC1
Show InChI InChI=1S/C30H30N4OS/c1-33-13-15-34(16-14-33)12-11-22-9-10-27-23(18-22)20-28-29(31-32-30(27)28)24-19-26(36-21-24)8-5-17-35-25-6-3-2-4-7-25/h2-4,6-7,9-10,18-19,21H,11-17,20H2,1H3,(H,31,32)
NCI pathway
Reactome pathway
n/an/a 58n/an/an/an/an/an/a
Abbott Laboratories
Curated by ChEMBL
Assay Description
Inhibition of VEGF-induced phosphorylation of human KDR expressed in mouse NIH3T3 cell line by Western blot
J Med Chem 50: 2011-29 (2007)
Article DOI: 10.1021/jm061223o
BindingDB Entry DOI: 10.7270/Q2TB16K0
Potassium voltage-gated channel subfamily H member 2
(Homo sapiens (Human))
BDBM50210299
(6-(2-(4-methylpiperazin-1-yl)ethyl)-3-(5-(3-phenox...)
Show SMILES CN1CCN(CCc2ccc-3c(Cc4c-3n[nH]c4-c3csc(c3)C#CCOc3ccccc3)c2)CC1
Show InChI InChI=1S/C30H30N4OS/c1-33-13-15-34(16-14-33)12-11-22-9-10-27-23(18-22)20-28-29(31-32-30(27)28)24-19-26(36-21-24)8-5-17-35-25-6-3-2-4-7-25/h2-4,6-7,9-10,18-19,21H,11-17,20H2,1H3,(H,31,32)
Reactome pathway
n/an/a 5.87E+3n/an/an/an/an/an/a
Abbott Laboratories
Curated by ChEMBL
Assay Description
Inhibition of hERG expressed in HEK293 cells assessed as effect on ionic current by patch clamp assay
J Med Chem 50: 2011-29 (2007)
Article DOI: 10.1021/jm061223o
BindingDB Entry DOI: 10.7270/Q2TB16K0
Vascular endothelial growth factor receptor 2
(Homo sapiens (Human))
BDBM50210299
(6-(2-(4-methylpiperazin-1-yl)ethyl)-3-(5-(3-phenox...)
Show SMILES CN1CCN(CCc2ccc-3c(Cc4c-3n[nH]c4-c3csc(c3)C#CCOc3ccccc3)c2)CC1
Show InChI InChI=1S/C30H30N4OS/c1-33-13-15-34(16-14-33)12-11-22-9-10-27-23(18-22)20-28-29(31-32-30(27)28)24-19-26(36-21-24)8-5-17-35-25-6-3-2-4-7-25/h2-4,6-7,9-10,18-19,21H,11-17,20H2,1H3,(H,31,32)
NCI pathway
Reactome pathway
n/an/a 5n/an/an/an/an/an/a
Abbott Laboratories
Curated by ChEMBL
Assay Description
Inhibition of VEGF-induced phosphorylation of human KDR expressed in mouse NIH3T3 cell line by Western blot
J Med Chem 50: 2011-29 (2007)
Article DOI: 10.1021/jm061223o
BindingDB Entry DOI: 10.7270/Q2TB16K0