BDBM50210346 CHEMBL3969320
SMILES: Oc1ccc(Br)cc1NC(=O)c1cc2ccc(Br)cc2[nH]1
InChI Key: InChIKey=LSXHXIVJLXARIK-UHFFFAOYSA-N
Data: 1 IC50
Activity Spreadsheet -- Enzyme Inhibition Constant Data from BindingDB
Found 1 hit for monomerid = 50210346
Trg + Lig
Ki
nM
ΔG°
kcal/mole
IC50
nM
Kd
nM
EC50/IC50
nM
koff
s-1
kon
M-1s-1
pHTemp
°C
Pyruvate kinase
(Staphylococcus aureus (strain MRSA252))
BDBM50210346
(CHEMBL3969320)
Show SMILES Oc1ccc(Br)cc1NC(=O)c1cc2ccc(Br)cc2[nH]1
Show InChI InChI=1S/C15H10Br2N2O2/c16-9-2-1-8-5-13(18-11(8)6-9)15(21)19-12-7-10(17)3-4-14(12)20/h1-7,18,20H,(H,19,21)
n/an/a 12n/an/an/an/an/an/a
Simon Fraser University
Curated by ChEMBL
Assay Description
Inhibition of recombinant N-terminal His-tagged methicillin-resistant Staphylococcus aureus MRSA252 pyruvate kinase expressed in Escherichia coli BL2...
Eur J Med Chem 125: 1-13 (2017)
Article DOI: 10.1016/j.ejmech.2016.09.018
BindingDB Entry DOI: 10.7270/Q2CC12P0