BDBM50210360 CHEMBL234096::N-(2-((4-cyano-4-(2-(trifluoromethyl)phenyl)cyclohexyl)methylamino)pyridin-3-yl)-3,3,3-trifluoropropanamide
SMILES: FC(F)(F)CC(=O)Nc1cccnc1NCC1CCC(CC1)(C#N)c1ccccc1C(F)(F)F
InChI Key: InChIKey=KWCVJAURCBEMIX-UHFFFAOYSA-N
Data: 1 KI  1 IC50
Activity Spreadsheet -- Enzyme Inhibition Constant Data from BindingDB
Found 2 hits for monomerid = 50210360
Trg + Lig
Ki
nM
ΔG°
kcal/mole
IC50
nM
Kd
nM
EC50/IC50
nM
koff
s-1
kon
M-1s-1
pHTemp
°C
B1 bradykinin receptor
(Homo sapiens (Human))
BDBM50210360
(CHEMBL234096 | N-(2-((4-cyano-4-(2-(trifluoromethy...)
Show SMILES FC(F)(F)CC(=O)Nc1cccnc1NCC1CCC(CC1)(C#N)c1ccccc1C(F)(F)F |(-8.05,-29.89,;-6.71,-30.66,;-5.95,-29.33,;-7.48,-31.99,;-5.38,-31.43,;-5.38,-32.96,;-6.71,-33.73,;-4.06,-33.75,;-4.05,-35.29,;-5.39,-36.06,;-5.39,-37.6,;-4.05,-38.36,;-2.73,-37.6,;-2.73,-36.06,;-1.41,-35.27,;-.08,-34.5,;1.27,-35.25,;1.28,-36.8,;2.61,-37.57,;3.96,-36.77,;3.94,-35.22,;2.59,-34.47,;5.36,-36.1,;6.75,-35.44,;4.51,-38.19,;6.05,-38.2,;6.81,-39.54,;6.03,-40.87,;4.48,-40.86,;3.73,-39.52,;2.19,-39.5,;.65,-39.51,;2.13,-37.97,;2.26,-41.04,)|
Show InChI InChI=1S/C23H22F6N4O/c24-22(25,26)12-19(34)33-18-6-3-11-31-20(18)32-13-15-7-9-21(14-30,10-8-15)16-4-1-2-5-17(16)23(27,28)29/h1-6,11,15H,7-10,12-13H2,(H,31,32)(H,33,34)
0.400n/an/an/an/an/an/an/an/a
Merck
Curated by ChEMBL
Assay Description
Binding affinity at human bradykinin B1 receptor
Bioorg Med Chem Lett 17: 3006-9 (2007)
Article DOI: 10.1016/j.bmcl.2007.03.059
BindingDB Entry DOI: 10.7270/Q29C6X4F
B1 bradykinin receptor
(Homo sapiens (Human))
BDBM50210360
(CHEMBL234096 | N-(2-((4-cyano-4-(2-(trifluoromethy...)
Show SMILES FC(F)(F)CC(=O)Nc1cccnc1NCC1CCC(CC1)(C#N)c1ccccc1C(F)(F)F |(-8.05,-29.89,;-6.71,-30.66,;-5.95,-29.33,;-7.48,-31.99,;-5.38,-31.43,;-5.38,-32.96,;-6.71,-33.73,;-4.06,-33.75,;-4.05,-35.29,;-5.39,-36.06,;-5.39,-37.6,;-4.05,-38.36,;-2.73,-37.6,;-2.73,-36.06,;-1.41,-35.27,;-.08,-34.5,;1.27,-35.25,;1.28,-36.8,;2.61,-37.57,;3.96,-36.77,;3.94,-35.22,;2.59,-34.47,;5.36,-36.1,;6.75,-35.44,;4.51,-38.19,;6.05,-38.2,;6.81,-39.54,;6.03,-40.87,;4.48,-40.86,;3.73,-39.52,;2.19,-39.5,;.65,-39.51,;2.13,-37.97,;2.26,-41.04,)|
Show InChI InChI=1S/C23H22F6N4O/c24-22(25,26)12-19(34)33-18-6-3-11-31-20(18)32-13-15-7-9-21(14-30,10-8-15)16-4-1-2-5-17(16)23(27,28)29/h1-6,11,15H,7-10,12-13H2,(H,31,32)(H,33,34)
n/an/a 1.15n/an/an/an/an/an/a
Merck
Curated by ChEMBL
Assay Description
Antagonist activity in human bradykinin B1 receptor by FLIPR method
Bioorg Med Chem Lett 17: 3006-9 (2007)
Article DOI: 10.1016/j.bmcl.2007.03.059
BindingDB Entry DOI: 10.7270/Q29C6X4F