BDBM50210511 4-[2-(2,4-difluorophenyl)-7-dimethylaminomethylimidazo[1,2-a]pyridin-3-yl]pyrimidin-2-ylamine::CHEMBL404625
SMILES: CN(C)Cc1ccn2c(c(nc2c1)-c1ccc(F)cc1F)-c1ccnc(N)n1
InChI Key: InChIKey=WCBRDLGHQPXONG-UHFFFAOYSA-N
Data: 1 IC50
Activity Spreadsheet -- Enzyme Inhibition Constant Data from BindingDB
Found 1 hit for monomerid = 50210511
Trg + Lig
Ki
nM
ΔG°
kcal/mole
IC50
nM
Kd
nM
EC50/IC50
nM
koff
s-1
kon
M-1s-1
pHTemp
°C
cGMP-dependent protein kinase
(Eimeria tenella)
BDBM50210511
(4-[2-(2,4-difluorophenyl)-7-dimethylaminomethylimi...)
Show SMILES CN(C)Cc1ccn2c(c(nc2c1)-c1ccc(F)cc1F)-c1ccnc(N)n1
Show InChI InChI=1S/C20H18F2N6/c1-27(2)11-12-6-8-28-17(9-12)26-18(14-4-3-13(21)10-15(14)22)19(28)16-5-7-24-20(23)25-16/h3-10H,11H2,1-2H3,(H2,23,24,25)
n/an/a 0.100n/an/an/an/an/an/a
SCYNEXIS, Inc.
Curated by ChEMBL
Assay Description
Inhibition of Eimeria tenella cGMP-dependent protein kinase by Ten_K assay
Eur J Med Chem 42: 1334-57 (2007)
Article DOI: 10.1016/j.ejmech.2007.02.006
BindingDB Entry DOI: 10.7270/Q2SB45FM