BDBM50210594 CHEMBL247355::N-(4-chlorobenzyl)-2-(((2-hydroxy-2-(quinolin-2-yl)ethyl)(methyl)amino)methyl)-7-methyl-4-oxo-4,7-dihydrothieno[2,3-b]pyridine-5-carboxamide
SMILES: CN(CC(O)c1ccc2ccccc2n1)Cc1cc2c(s1)n(C)cc(C(=O)NCc1ccc(Cl)cc1)c2=O
InChI Key: InChIKey=SOBNSMKVKLKCQJ-UHFFFAOYSA-N
Data: 1 IC50
Activity Spreadsheet -- Enzyme Inhibition Constant Data from BindingDB
Found 1 hit for monomerid = 50210594
Trg + Lig
Ki
nM
ΔG°
kcal/mole
IC50
nM
Kd
nM
EC50/IC50
nM
koff
s-1
kon
M-1s-1
pHTemp
°C
DNA polymerase
(Human cytomegalovirus (HCMV strain AD169) )
BDBM50210594
(CHEMBL247355 | N-(4-chlorobenzyl)-2-(((2-hydroxy-2...)
Show SMILES CN(CC(O)c1ccc2ccccc2n1)Cc1cc2c(s1)n(C)cc(C(=O)NCc1ccc(Cl)cc1)c2=O |w:3.3|
Show InChI InChI=1S/C29H27ClN4O3S/c1-33(17-26(35)25-12-9-19-5-3-4-6-24(19)32-25)15-21-13-22-27(36)23(16-34(2)29(22)38-21)28(37)31-14-18-7-10-20(30)11-8-18/h3-13,16,26,35H,14-15,17H2,1-2H3,(H,31,37)
n/an/a 65n/an/an/an/an/an/a
Pfizer Inc.
Curated by ChEMBL
Assay Description
Inhibition of HCMV DNA polymerase by scintillation proximity assay
Bioorg Med Chem Lett 17: 3349-53 (2007)
Article DOI: 10.1016/j.bmcl.2007.03.102
BindingDB Entry DOI: 10.7270/Q2HX1DHN