BDBM50210600 CHEMBL246523::N-(4-fluorobenzyl)-2-(((2-(4-fluorophenyl)-2-hydroxyethyl)(methyl)amino)methyl)-7-methyl-4-oxo-4,7-dihydrothieno[2,3-b]pyridine-5-carboxamide
SMILES: CN(CC(O)c1ccc(F)cc1)Cc1cc2c(s1)n(C)cc(C(=O)NCc1ccc(F)cc1)c2=O
InChI Key: InChIKey=MXMYSZAOCNDKMW-UHFFFAOYSA-N
Data: 1 IC50
Activity Spreadsheet -- Enzyme Inhibition Constant Data from BindingDB
Found 1 hit for monomerid = 50210600
Trg + Lig
Ki
nM
ΔG°
kcal/mole
IC50
nM
Kd
nM
EC50/IC50
nM
koff
s-1
kon
M-1s-1
pHTemp
°C
DNA polymerase
(Human cytomegalovirus (HCMV strain AD169) )
BDBM50210600
(CHEMBL246523 | N-(4-fluorobenzyl)-2-(((2-(4-fluoro...)
Show SMILES CN(CC(O)c1ccc(F)cc1)Cc1cc2c(s1)n(C)cc(C(=O)NCc1ccc(F)cc1)c2=O |w:3.3|
Show InChI InChI=1S/C26H25F2N3O3S/c1-30(15-23(32)17-5-9-19(28)10-6-17)13-20-11-21-24(33)22(14-31(2)26(21)35-20)25(34)29-12-16-3-7-18(27)8-4-16/h3-11,14,23,32H,12-13,15H2,1-2H3,(H,29,34)
n/an/a 220n/an/an/an/an/an/a
Pfizer Inc.
Curated by ChEMBL
Assay Description
Inhibition of HCMV DNA polymerase by scintillation proximity assay
Bioorg Med Chem Lett 17: 3349-53 (2007)
Article DOI: 10.1016/j.bmcl.2007.03.102
BindingDB Entry DOI: 10.7270/Q2HX1DHN