BDBM50210601 CHEMBL246525::N-(3-chlorobenzyl)-2-(((2-hydroxy-2-(pyridin-2-yl)ethyl)(methyl)amino)methyl)-7-methyl-4-oxo-4,7-dihydrothieno[2,3-b]pyridine-5-carboxamide
SMILES: CN(CC(O)c1ccccn1)Cc1cc2c(s1)n(C)cc(C(=O)NCc1cccc(Cl)c1)c2=O
InChI Key: InChIKey=TUOXSRSZGSCDAC-UHFFFAOYSA-N
Data: 1 IC50
Activity Spreadsheet -- Enzyme Inhibition Constant Data from BindingDB
Found 1 hit for monomerid = 50210601
Trg + Lig
Ki
nM
ΔG°
kcal/mole
IC50
nM
Kd
nM
EC50/IC50
nM
koff
s-1
kon
M-1s-1
pHTemp
°C
DNA polymerase
(Human cytomegalovirus (HCMV strain AD169) )
BDBM50210601
(CHEMBL246525 | N-(3-chlorobenzyl)-2-(((2-hydroxy-2...)
Show SMILES CN(CC(O)c1ccccn1)Cc1cc2c(s1)n(C)cc(C(=O)NCc1cccc(Cl)c1)c2=O |w:3.3|
Show InChI InChI=1S/C25H25ClN4O3S/c1-29(15-22(31)21-8-3-4-9-27-21)13-18-11-19-23(32)20(14-30(2)25(19)34-18)24(33)28-12-16-6-5-7-17(26)10-16/h3-11,14,22,31H,12-13,15H2,1-2H3,(H,28,33)
n/an/a 86n/an/an/an/an/an/a
Pfizer Inc.
Curated by ChEMBL
Assay Description
Inhibition of HCMV DNA polymerase by scintillation proximity assay
Bioorg Med Chem Lett 17: 3349-53 (2007)
Article DOI: 10.1016/j.bmcl.2007.03.102
BindingDB Entry DOI: 10.7270/Q2HX1DHN