BDBM50210649 (R)-3-amino-1-(3-(difluoromethyl)-5,6-dihydro-[1,2,4]triazolo[4,3-a]pyrazin-7(8H)-yl)-4-(2,4,5-trifluorophenyl)butan-1-one::CHEMBL390240
SMILES: N[C@@H](CC(=O)N1CCn2c(C1)nnc2C(F)F)Cc1cc(F)c(F)cc1F
InChI Key: InChIKey=NBSCPMDKIXMVIA-SECBINFHSA-N
Data: 3 IC50
Activity Spreadsheet -- Enzyme Inhibition Constant Data from BindingDB
Found 3 hits for monomerid = 50210649
Trg + Lig
Ki
nM
ΔG°
kcal/mole
IC50
nM
Kd
nM
EC50/IC50
nM
koff
s-1
kon
M-1s-1
pHTemp
°C
Dipeptidyl peptidase 4
(Homo sapiens (Human))
BDBM50210649
((R)-3-amino-1-(3-(difluoromethyl)-5,6-dihydro-[1,2...)
Show SMILES N[C@@H](CC(=O)N1CCn2c(C1)nnc2C(F)F)Cc1cc(F)c(F)cc1F
Show InChI InChI=1S/C16H16F5N5O/c17-10-6-12(19)11(18)4-8(10)3-9(22)5-14(27)25-1-2-26-13(7-25)23-24-16(26)15(20)21/h4,6,9,15H,1-3,5,7,22H2/t9-/m1/s1
Reactome pathway
n/an/a 29n/an/an/an/an/an/a
Merck Research Laboratories
Curated by ChEMBL
Assay Description
Inhibition of DPP4 activity
Bioorg Med Chem Lett 17: 3373-7 (2007)
Article DOI: 10.1016/j.bmcl.2007.03.098
BindingDB Entry DOI: 10.7270/Q2W37W04
Dipeptidyl peptidase 9
(Homo sapiens (Human))
BDBM50210649
((R)-3-amino-1-(3-(difluoromethyl)-5,6-dihydro-[1,2...)
Show SMILES N[C@@H](CC(=O)N1CCn2c(C1)nnc2C(F)F)Cc1cc(F)c(F)cc1F
Show InChI InChI=1S/C16H16F5N5O/c17-10-6-12(19)11(18)4-8(10)3-9(22)5-14(27)25-1-2-26-13(7-25)23-24-16(26)15(20)21/h4,6,9,15H,1-3,5,7,22H2/t9-/m1/s1
n/an/a>1.00E+5n/an/an/an/an/an/a
Merck Research Laboratories
Curated by ChEMBL
Assay Description
Inhibition of DPP9 activity
Bioorg Med Chem Lett 17: 3373-7 (2007)
Article DOI: 10.1016/j.bmcl.2007.03.098
BindingDB Entry DOI: 10.7270/Q2W37W04
Dipeptidyl peptidase VIII
(Homo sapiens (Human))
BDBM50210649
((R)-3-amino-1-(3-(difluoromethyl)-5,6-dihydro-[1,2...)
Show SMILES N[C@@H](CC(=O)N1CCn2c(C1)nnc2C(F)F)Cc1cc(F)c(F)cc1F
Show InChI InChI=1S/C16H16F5N5O/c17-10-6-12(19)11(18)4-8(10)3-9(22)5-14(27)25-1-2-26-13(7-25)23-24-16(26)15(20)21/h4,6,9,15H,1-3,5,7,22H2/t9-/m1/s1
n/an/a 8.60E+4n/an/an/an/an/an/a
Merck Research Laboratories
Curated by ChEMBL
Assay Description
Inhibition of DPP8 activity
Bioorg Med Chem Lett 17: 3373-7 (2007)
Article DOI: 10.1016/j.bmcl.2007.03.098
BindingDB Entry DOI: 10.7270/Q2W37W04