BDBM50210657 (R)-3-amino-4-(2,4-dichlorophenyl)-1-(3-(trifluoromethyl)-5,6-dihydro-[1,2,4]triazolo[4,3-a]pyrazin-7(8H)-yl)butan-1-one::CHEMBL235120::CHEMBL235120 (16)
SMILES: N[C@@H](CC(=O)N1CCn2c(C1)nnc2C(F)(F)F)Cc1ccc(Cl)cc1Cl
InChI Key: InChIKey=DHJHUJLYMKNWHR-LLVKDONJSA-N
Data: 4 IC50
Activity Spreadsheet -- Enzyme Inhibition Constant Data from BindingDB
Found 4 hits for monomerid = 50210657
Trg + Lig
Ki
nM
ΔG°
kcal/mole
IC50
nM
Kd
nM
EC50/IC50
nM
koff
s-1
kon
M-1s-1
pHTemp
°C
Dipeptidyl peptidase 4
(Homo sapiens (Human))
BDBM50210657
((R)-3-amino-4-(2,4-dichlorophenyl)-1-(3-(trifluoro...)
Show SMILES N[C@@H](CC(=O)N1CCn2c(C1)nnc2C(F)(F)F)Cc1ccc(Cl)cc1Cl
Show InChI InChI=1S/C16H16Cl2F3N5O/c17-10-2-1-9(12(18)6-10)5-11(22)7-14(27)25-3-4-26-13(8-25)23-24-15(26)16(19,20)21/h1-2,6,11H,3-5,7-8,22H2/t11-/m1/s1
Reactome pathway
n/an/a 23n/an/an/an/an/an/a
China Pharmaceutical University
Assay Description
The HypoGen module in DS2.5 was employed to produce pharmaphores with the training set compounds.
Chem Biol Drug Des 84: 364-77 (2014)
Article DOI: 10.1111/cbdd.12327
BindingDB Entry DOI: 10.7270/Q2D21W96
Dipeptidyl peptidase VIII
(Homo sapiens (Human))
BDBM50210657
((R)-3-amino-4-(2,4-dichlorophenyl)-1-(3-(trifluoro...)
Show SMILES N[C@@H](CC(=O)N1CCn2c(C1)nnc2C(F)(F)F)Cc1ccc(Cl)cc1Cl
Show InChI InChI=1S/C16H16Cl2F3N5O/c17-10-2-1-9(12(18)6-10)5-11(22)7-14(27)25-3-4-26-13(8-25)23-24-15(26)16(19,20)21/h1-2,6,11H,3-5,7-8,22H2/t11-/m1/s1
n/an/a 3.00E+4n/an/an/an/an/an/a
Merck Research Laboratories
Curated by ChEMBL
Assay Description
Inhibition of DPP8 activity
Bioorg Med Chem Lett 17: 3373-7 (2007)
Article DOI: 10.1016/j.bmcl.2007.03.098
BindingDB Entry DOI: 10.7270/Q2W37W04
Dipeptidyl peptidase 4
(Homo sapiens (Human))
BDBM50210657
((R)-3-amino-4-(2,4-dichlorophenyl)-1-(3-(trifluoro...)
Show SMILES N[C@@H](CC(=O)N1CCn2c(C1)nnc2C(F)(F)F)Cc1ccc(Cl)cc1Cl
Show InChI InChI=1S/C16H16Cl2F3N5O/c17-10-2-1-9(12(18)6-10)5-11(22)7-14(27)25-3-4-26-13(8-25)23-24-15(26)16(19,20)21/h1-2,6,11H,3-5,7-8,22H2/t11-/m1/s1
Reactome pathway
n/an/a 23n/an/an/an/an/an/a
Merck Research Laboratories
Curated by ChEMBL
Assay Description
Inhibition of DPP4 activity
Bioorg Med Chem Lett 17: 3373-7 (2007)
Article DOI: 10.1016/j.bmcl.2007.03.098
BindingDB Entry DOI: 10.7270/Q2W37W04
Dipeptidyl peptidase 9
(Homo sapiens (Human))
BDBM50210657
((R)-3-amino-4-(2,4-dichlorophenyl)-1-(3-(trifluoro...)
Show SMILES N[C@@H](CC(=O)N1CCn2c(C1)nnc2C(F)(F)F)Cc1ccc(Cl)cc1Cl
Show InChI InChI=1S/C16H16Cl2F3N5O/c17-10-2-1-9(12(18)6-10)5-11(22)7-14(27)25-3-4-26-13(8-25)23-24-15(26)16(19,20)21/h1-2,6,11H,3-5,7-8,22H2/t11-/m1/s1
n/an/a 4.90E+4n/an/an/an/an/an/a
Merck Research Laboratories
Curated by ChEMBL
Assay Description
Inhibition of DPP9 activity
Bioorg Med Chem Lett 17: 3373-7 (2007)
Article DOI: 10.1016/j.bmcl.2007.03.098
BindingDB Entry DOI: 10.7270/Q2W37W04