BDBM50210696 CHEMBL3905242
SMILES: COc1cc2c(Nc3ccc(NC(=O)Nc4ccc(Cl)cc4)cc3)ncnc2cc1OCCCN1CCN(C)CC1
InChI Key: InChIKey=YRRBEGBNIWCLLB-UHFFFAOYSA-N
Data: 2 IC50
Activity Spreadsheet -- Enzyme Inhibition Constant Data from BindingDB
Found 2 hits for monomerid = 50210696
Trg + Lig
Ki
nM
ΔG°
kcal/mole
IC50
nM
Kd
nM
EC50/IC50
nM
koff
s-1
kon
M-1s-1
pHTemp
°C
Vascular endothelial growth factor receptor 2
(Homo sapiens (Human))
BDBM50210696
(CHEMBL3905242)
Show SMILES COc1cc2c(Nc3ccc(NC(=O)Nc4ccc(Cl)cc4)cc3)ncnc2cc1OCCCN1CCN(C)CC1
Show InChI InChI=1S/C30H34ClN7O3/c1-37-13-15-38(16-14-37)12-3-17-41-28-19-26-25(18-27(28)40-2)29(33-20-32-26)34-22-8-10-24(11-9-22)36-30(39)35-23-6-4-21(31)5-7-23/h4-11,18-20H,3,12-17H2,1-2H3,(H,32,33,34)(H2,35,36,39)
NCI pathway
Reactome pathway
n/an/a 815n/an/an/an/an/an/a
China Pharmaceutical University
Curated by ChEMBL
Assay Description
Inhibition of N-terminal GST-tagged human VEGFR-2 cytoplasmic domain (790 to 1356 residues) expressed in baculovirus expression system preincubated f...
Eur J Med Chem 125: 245-254 (2017)
Article DOI: 10.1016/j.ejmech.2016.09.039
BindingDB Entry DOI: 10.7270/Q2QJ7K9C
Epidermal growth factor receptor
(Homo sapiens (Human))
BDBM50210696
(CHEMBL3905242)
Show SMILES COc1cc2c(Nc3ccc(NC(=O)Nc4ccc(Cl)cc4)cc3)ncnc2cc1OCCCN1CCN(C)CC1
Show InChI InChI=1S/C30H34ClN7O3/c1-37-13-15-38(16-14-37)12-3-17-41-28-19-26-25(18-27(28)40-2)29(33-20-32-26)34-22-8-10-24(11-9-22)36-30(39)35-23-6-4-21(31)5-7-23/h4-11,18-20H,3,12-17H2,1-2H3,(H,32,33,34)(H2,35,36,39)
n/an/a 235n/an/an/an/an/an/a
China Pharmaceutical University
Curated by ChEMBL
Assay Description
Inhibition of N-terminal GST-tagged human EGFR cytoplasmic domain (669 to 1210 residues) expressed in baculovirus expression system preincubated for ...
Eur J Med Chem 125: 245-254 (2017)
Article DOI: 10.1016/j.ejmech.2016.09.039
BindingDB Entry DOI: 10.7270/Q2QJ7K9C