BDBM50211109 (1S,2S,5S,6S,9S,10R,15S)-6-hydroxy-5-methyl-16-oxapentacyclo[13.3.2.0^{1,13}.0^{2,10}.0^{5,9}]icos-12-en-17-one::CHEMBL245771
SMILES: C[C@]12CC[C@H]3[C@@H](CC=C4C[C@@H]5CC[C@]34CC(=O)O5)[C@@H]1CC[C@@H]2O
InChI Key: InChIKey=OWEPYNBKZRBVME-JYLNUJPASA-N
Data: 3 IC50  2 EC50
Activity Spreadsheet -- Enzyme Inhibition Constant Data from BindingDB
Found 5 hits for monomerid = 50211109
Trg + Lig
Ki
nM
ΔG°
kcal/mole
IC50
nM
Kd
nM
EC50/IC50
nM
koff
s-1
kon
M-1s-1
pHTemp
°C
Estradiol receptor beta (ERβ)
(Homo sapiens (Human))
BDBM50211109
((1S,2S,5S,6S,9S,10R,15S)-6-hydroxy-5-methyl-16-oxa...)
Show SMILES C[C@]12CC[C@H]3[C@@H](CC=C4C[C@@H]5CC[C@]34CC(=O)O5)[C@@H]1CC[C@@H]2O |t:7|
Show InChI InChI=1S/C20H28O3/c1-19-8-7-16-14(15(19)4-5-17(19)21)3-2-12-10-13-6-9-20(12,16)11-18(22)23-13/h2,13-17,21H,3-11H2,1H3/t13-,14-,15-,16-,17-,19-,20+/m0/s1
n/an/an/an/a>1.00E+3n/an/an/an/a
Merck Research Laboratories
Curated by ChEMBL
Assay Description
Agonist activity at human recombinant ERbeta expressed in HEK293 cells by transactivation assay
Bioorg Med Chem Lett 17: 2944-8 (2007)
Article DOI: 10.1016/j.bmcl.2006.12.053
BindingDB Entry DOI: 10.7270/Q2D50NS7
Androgen Receptor
(Homo sapiens (Human))
BDBM50211109
((1S,2S,5S,6S,9S,10R,15S)-6-hydroxy-5-methyl-16-oxa...)
Show SMILES C[C@]12CC[C@H]3[C@@H](CC=C4C[C@@H]5CC[C@]34CC(=O)O5)[C@@H]1CC[C@@H]2O |t:7|
Show InChI InChI=1S/C20H28O3/c1-19-8-7-16-14(15(19)4-5-17(19)21)3-2-12-10-13-6-9-20(12,16)11-18(22)23-13/h2,13-17,21H,3-11H2,1H3/t13-,14-,15-,16-,17-,19-,20+/m0/s1
NCI pathway
Reactome pathway
n/an/a>1.00E+3n/an/an/an/an/an/a
Merck Research Laboratories
Curated by ChEMBL
Assay Description
Binding affinity to androgen receptor
Bioorg Med Chem Lett 17: 2944-8 (2007)
Article DOI: 10.1016/j.bmcl.2006.12.053
BindingDB Entry DOI: 10.7270/Q2D50NS7
Estrogen receptor
(Homo sapiens (Human))
BDBM50211109
((1S,2S,5S,6S,9S,10R,15S)-6-hydroxy-5-methyl-16-oxa...)
Show SMILES C[C@]12CC[C@H]3[C@@H](CC=C4C[C@@H]5CC[C@]34CC(=O)O5)[C@@H]1CC[C@@H]2O |t:7|
Show InChI InChI=1S/C20H28O3/c1-19-8-7-16-14(15(19)4-5-17(19)21)3-2-12-10-13-6-9-20(12,16)11-18(22)23-13/h2,13-17,21H,3-11H2,1H3/t13-,14-,15-,16-,17-,19-,20+/m0/s1
n/an/a>1.00E+4n/an/an/an/an/an/a
Merck Research Laboratories
Curated by ChEMBL
Assay Description
Binding affinity to human recombinant ERalpha by scintillation proximity assay
Bioorg Med Chem Lett 17: 2944-8 (2007)
Article DOI: 10.1016/j.bmcl.2006.12.053
BindingDB Entry DOI: 10.7270/Q2D50NS7
Estrogen receptor
(Homo sapiens (Human))
BDBM50211109
((1S,2S,5S,6S,9S,10R,15S)-6-hydroxy-5-methyl-16-oxa...)
Show SMILES C[C@]12CC[C@H]3[C@@H](CC=C4C[C@@H]5CC[C@]34CC(=O)O5)[C@@H]1CC[C@@H]2O |t:7|
Show InChI InChI=1S/C20H28O3/c1-19-8-7-16-14(15(19)4-5-17(19)21)3-2-12-10-13-6-9-20(12,16)11-18(22)23-13/h2,13-17,21H,3-11H2,1H3/t13-,14-,15-,16-,17-,19-,20+/m0/s1
n/an/an/an/a>1.00E+3n/an/an/an/a
Merck Research Laboratories
Curated by ChEMBL
Assay Description
Agonist activity at human recombinant ERalpha expressed in HEK293 cells by transactivation assay
Bioorg Med Chem Lett 17: 2944-8 (2007)
Article DOI: 10.1016/j.bmcl.2006.12.053
BindingDB Entry DOI: 10.7270/Q2D50NS7
Estradiol receptor beta (ERβ)
(Homo sapiens (Human))
BDBM50211109
((1S,2S,5S,6S,9S,10R,15S)-6-hydroxy-5-methyl-16-oxa...)
Show SMILES C[C@]12CC[C@H]3[C@@H](CC=C4C[C@@H]5CC[C@]34CC(=O)O5)[C@@H]1CC[C@@H]2O |t:7|
Show InChI InChI=1S/C20H28O3/c1-19-8-7-16-14(15(19)4-5-17(19)21)3-2-12-10-13-6-9-20(12,16)11-18(22)23-13/h2,13-17,21H,3-11H2,1H3/t13-,14-,15-,16-,17-,19-,20+/m0/s1
n/an/a>1.00E+4n/an/an/an/an/an/a
Merck Research Laboratories
Curated by ChEMBL
Assay Description
Binding affinity to human recombinant ERbeta by scintillation proximity assay
Bioorg Med Chem Lett 17: 2944-8 (2007)
Article DOI: 10.1016/j.bmcl.2006.12.053
BindingDB Entry DOI: 10.7270/Q2D50NS7