BDBM50211133 (R)-N-(1-(3-(4-(methylsulfonyl)phenyl)-4-oxo-3,4-dihydroquinazolin-2-yl)ethyl)-N-(pyridin-3-ylmethyl)-2-(4-(trifluoromethyl)phenyl)acetamide::CHEMBL395747
SMILES: C[C@@H](N(Cc1cccnc1)C(=O)Cc1ccc(cc1)C(F)(F)F)c1nc2ccccc2c(=O)n1-c1ccc(cc1)S(C)(=O)=O
InChI Key: InChIKey=VNNVUUHHDLZIDA-OAQYLSRUSA-N
Data: 1 IC50
Activity Spreadsheet -- Enzyme Inhibition Constant Data from BindingDB
Found 1 hit for monomerid = 50211133
Trg + Lig
Ki
nM
ΔG°
kcal/mole
IC50
nM
Kd
nM
EC50/IC50
nM
koff
s-1
kon
M-1s-1
pHTemp
°C
chemokine (C-X-C motif) receptor 3
(Homo sapiens (Human))
BDBM50211133
((R)-N-(1-(3-(4-(methylsulfonyl)phenyl)-4-oxo-3,4-d...)
Show SMILES C[C@@H](N(Cc1cccnc1)C(=O)Cc1ccc(cc1)C(F)(F)F)c1nc2ccccc2c(=O)n1-c1ccc(cc1)S(C)(=O)=O
Show InChI InChI=1S/C32H27F3N4O4S/c1-21(38(20-23-6-5-17-36-19-23)29(40)18-22-9-11-24(12-10-22)32(33,34)35)30-37-28-8-4-3-7-27(28)31(41)39(30)25-13-15-26(16-14-25)44(2,42)43/h3-17,19,21H,18,20H2,1-2H3/t21-/m1/s1
n/an/a 1.00E+4n/an/an/an/an/an/a
Amgen Inc.
Curated by ChEMBL
Assay Description
Displacement of [125I ]IP10 from CXCR3 receptor expressed in PBMC
Bioorg Med Chem Lett 17: 3339-43 (2007)
Article DOI: 10.1016/j.bmcl.2007.03.106
BindingDB Entry DOI: 10.7270/Q2VT1SXN