BDBM50211232 CHEMBL3929187
SMILES: CCOC(=O)c1c(C)n(Cc2ccccc2)c2ccc(OCCCNCc3ccc(Oc4nnnn4-c4ccccc4)c(OC)c3)cc12
InChI Key: InChIKey=BGXAJQJCJVYFNR-UHFFFAOYSA-N
Data: 1 IC50
Activity Spreadsheet -- Enzyme Inhibition Constant Data from BindingDB
Found 1 hit for monomerid = 50211232
Trg + Lig
Ki
nM
ΔG°
kcal/mole
IC50
nM
Kd
nM
EC50/IC50
nM
koff
s-1
kon
M-1s-1
pHTemp
°C
Quinolone resistance protein norA
(Staphylococcus aureus)
BDBM50211232
(CHEMBL3929187)
Show SMILES CCOC(=O)c1c(C)n(Cc2ccccc2)c2ccc(OCCCNCc3ccc(Oc4nnnn4-c4ccccc4)c(OC)c3)cc12
Show InChI InChI=1S/C37H38N6O5/c1-4-46-36(44)35-26(2)42(25-27-12-7-5-8-13-27)32-18-17-30(23-31(32)35)47-21-11-20-38-24-28-16-19-33(34(22-28)45-3)48-37-39-40-41-43(37)29-14-9-6-10-15-29/h5-10,12-19,22-23,38H,4,11,20-21,24-25H2,1-3H3
n/an/a 1.80E+3n/an/an/an/an/an/a
University of Perugia
Curated by ChEMBL
Assay Description
Inhibition of Staphylococcus aureus 1199B NorA assessed as inhibition of ethidium bromide efflux measured after 5 mins by fluorometric method
J Med Chem 60: 517-523 (2017)
Article DOI: 10.1021/acs.jmedchem.6b01281
BindingDB Entry DOI: 10.7270/Q2D79DKR