BDBM50211248 CHEMBL428575::trimethyl-[(7-oxo-7H-1-aza-benzo[de]anthracen-9-ylcarbamoyl)-methyl]-ammonium
SMILES: C[N+](C)(C)CC(=O)Nc1ccc-2c(c1)C(=O)c1cccc3ccnc-2c13
InChI Key: InChIKey=ANYPXMZOOFVUQB-UHFFFAOYSA-O
Data: 2 IC50
Activity Spreadsheet -- Enzyme Inhibition Constant Data from BindingDB
Found 2 hits for monomerid = 50211248
Trg + Lig
Ki
nM
ΔG°
kcal/mole
IC50
nM
Kd
nM
EC50/IC50
nM
koff
s-1
kon
M-1s-1
pHTemp
°C
Butyrylcholinesterase (BChE)
(Equus caballus (Horse))
BDBM50211248
(CHEMBL428575 | trimethyl-[(7-oxo-7H-1-aza-benzo[de...)
Show SMILES C[N+](C)(C)CC(=O)Nc1ccc-2c(c1)C(=O)c1cccc3ccnc-2c13
Show InChI InChI=1S/C21H19N3O2/c1-24(2,3)12-18(25)23-14-7-8-15-17(11-14)21(26)16-6-4-5-13-9-10-22-20(15)19(13)16/h4-11H,12H2,1-3H3/p+1
n/an/a 1.31E+3n/an/an/an/an/an/a
Sun Yat-Sen University
Curated by ChEMBL
Assay Description
Inhibition of equine serum BuChE
Bioorg Med Chem Lett 17: 3765-8 (2007)
Article DOI: 10.1016/j.bmcl.2007.04.015
BindingDB Entry DOI: 10.7270/Q28C9X2C
Acetylcholinesterase
(Electrophorus electricus (Electric eel))
BDBM50211248
(CHEMBL428575 | trimethyl-[(7-oxo-7H-1-aza-benzo[de...)
Show SMILES C[N+](C)(C)CC(=O)Nc1ccc-2c(c1)C(=O)c1cccc3ccnc-2c13
Show InChI InChI=1S/C21H19N3O2/c1-24(2,3)12-18(25)23-14-7-8-15-17(11-14)21(26)16-6-4-5-13-9-10-22-20(15)19(13)16/h4-11H,12H2,1-3H3/p+1
n/an/a 14.9n/an/an/an/an/an/a
Sun Yat-Sen University
Curated by ChEMBL
Assay Description
Inhibition of electric eel AChE
Bioorg Med Chem Lett 17: 3765-8 (2007)
Article DOI: 10.1016/j.bmcl.2007.04.015
BindingDB Entry DOI: 10.7270/Q28C9X2C