null
SMILES: NCCO.COCOc1cc2ccccc2cc1CCc1c([nH]c(=O)[nH]c1=O)C(O)=O
InChI Key: InChIKey=UIWLSMYBMFEGSE-UHFFFAOYSA-N
Activity Spreadsheet -- Enzyme Inhibition Constant Data from BindingDB
Found 2 hits for monomerid = 50211712
Trg + Lig
Ki
nM
ΔG°
kcal/mole
IC50
nM
Kd
nM
EC50/IC50
nM
koff
s-1
kon
M-1s-1
pHTemp
°C
Dihydroorotate dehydrogenase (quinone), mitochondrial
(Homo sapiens (Human))
BDBM50211712
(CHEMBL3905364)
Show SMILES NCCO.COCOc1cc2ccccc2cc1CCc1c([nH]c(=O)[nH]c1=O)C(O)=O
Show InChI InChI=1S/C19H18N2O6/c1-26-10-27-15-9-12-5-3-2-4-11(12)8-13(15)6-7-14-16(18(23)24)20-19(25)21-17(14)22/h2-5,8-9H,6-7,10H2,1H3,(H,23,24)(H2,20,21,22,25)
Reactome pathway
2.22E+4n/an/an/an/an/an/an/an/a
Nagasaki University
Curated by ChEMBL
Assay Description
Inhibition of human dihydroorotate dehydrogenase assessed as reduction in orotate production using L-dihydroorotate as substrate measured after 20 mi...
Bioorg Med Chem 25: 1465-1470 (2017)
Article DOI: 10.1016/j.bmc.2017.01.009
BindingDB Entry DOI: 10.7270/Q2CC12TS
Dihydroorotate dehydrogenase (quinone), mitochondrial
(Homo sapiens (Human))
BDBM50211712
(CHEMBL3905364)
Show SMILES NCCO.COCOc1cc2ccccc2cc1CCc1c([nH]c(=O)[nH]c1=O)C(O)=O
Show InChI InChI=1S/C19H18N2O6/c1-26-10-27-15-9-12-5-3-2-4-11(12)8-13(15)6-7-14-16(18(23)24)20-19(25)21-17(14)22/h2-5,8-9H,6-7,10H2,1H3,(H,23,24)(H2,20,21,22,25)
Reactome pathway
n/an/a 44n/an/an/an/an/an/a
Nagasaki University
Curated by ChEMBL
Assay Description
Inhibition of human dihydroorotate dehydrogenase assessed as reduction in orotate production using L-dihydroorotate as substrate measured after 20 mi...
Bioorg Med Chem 25: 1465-1470 (2017)
Article DOI: 10.1016/j.bmc.2017.01.009
BindingDB Entry DOI: 10.7270/Q2CC12TS