null
SMILES: CC(C)(N)c1ccc(cc1)-c1nc(Nc2ccc(CCN3CCOCC3)cc2)ncc1C#N
InChI Key: InChIKey=MROGTPNQSHMKIG-UHFFFAOYSA-N
Activity Spreadsheet -- Enzyme Inhibition Constant Data from BindingDB
Found 2 hits for monomerid = 50212029
Trg + Lig
Ki
nM
ΔG°
kcal/mole
IC50
nM
Kd
nM
EC50/IC50
nM
koff
s-1
kon
M-1s-1
pHTemp
°C
Vascular endothelial growth factor receptor 2
(Homo sapiens (Human))
BDBM50212029
(4-(4-(2-aminopropan-2-yl)phenyl)-2-(4-(2-morpholin...)
Show SMILES CC(C)(N)c1ccc(cc1)-c1nc(Nc2ccc(CCN3CCOCC3)cc2)ncc1C#N
Show InChI InChI=1S/C26H30N6O/c1-26(2,28)22-7-5-20(6-8-22)24-21(17-27)18-29-25(31-24)30-23-9-3-19(4-10-23)11-12-32-13-15-33-16-14-32/h3-10,18H,11-16,28H2,1-2H3,(H,29,30,31)
NCI pathway
Reactome pathway
n/an/a 27n/an/an/an/an/an/a
Johnson & Johnson Pharmaceutical Research and Development
Curated by ChEMBL
Assay Description
Inhibition of VEGFR2 activity
Bioorg Med Chem Lett 17: 3266-70 (2007)
Article DOI: 10.1016/j.bmcl.2007.04.021
BindingDB Entry DOI: 10.7270/Q2GQ6XFG
Cyclin-dependent kinase 1
(Homo sapiens (Human))
BDBM50212029
(4-(4-(2-aminopropan-2-yl)phenyl)-2-(4-(2-morpholin...)
Show SMILES CC(C)(N)c1ccc(cc1)-c1nc(Nc2ccc(CCN3CCOCC3)cc2)ncc1C#N
Show InChI InChI=1S/C26H30N6O/c1-26(2,28)22-7-5-20(6-8-22)24-21(17-27)18-29-25(31-24)30-23-9-3-19(4-10-23)11-12-32-13-15-33-16-14-32/h3-10,18H,11-16,28H2,1-2H3,(H,29,30,31)
Reactome pathway
n/an/a 4.10E+3n/an/an/an/an/an/a
Johnson & Johnson Pharmaceutical Research and Development
Curated by ChEMBL
Assay Description
Inhibition of CDK1 activity
Bioorg Med Chem Lett 17: 3266-70 (2007)
Article DOI: 10.1016/j.bmcl.2007.04.021
BindingDB Entry DOI: 10.7270/Q2GQ6XFG