null
SMILES: NCCO.COc1ccc2cc(CCc3c([nH]c(=O)[nH]c3=O)C(O)=O)c(OC)cc2c1
InChI Key: InChIKey=ZWWHFNCLURKBGD-UHFFFAOYSA-N
Activity Spreadsheet -- Enzyme Inhibition Constant Data from BindingDB
Found 2 hits for monomerid = 50212059
Trg + Lig
Ki
nM
ΔG°
kcal/mole
IC50
nM
Kd
nM
EC50/IC50
nM
koff
s-1
kon
M-1s-1
pHTemp
°C
Dihydroorotate dehydrogenase (quinone), mitochondrial
(Homo sapiens (Human))
BDBM50212059
(CHEMBL3945267)
Show SMILES NCCO.COc1ccc2cc(CCc3c([nH]c(=O)[nH]c3=O)C(O)=O)c(OC)cc2c1
Show InChI InChI=1S/C19H18N2O6/c1-26-13-5-3-10-7-11(15(27-2)9-12(10)8-13)4-6-14-16(18(23)24)20-19(25)21-17(14)22/h3,5,7-9H,4,6H2,1-2H3,(H,23,24)(H2,20,21,22,25)
Reactome pathway
2.39E+4n/an/an/an/an/an/an/an/a
Nagasaki University
Curated by ChEMBL
Assay Description
Inhibition of human dihydroorotate dehydrogenase assessed as reduction in orotate production using L-dihydroorotate as substrate measured after 20 mi...
Bioorg Med Chem 25: 1465-1470 (2017)
Article DOI: 10.1016/j.bmc.2017.01.009
BindingDB Entry DOI: 10.7270/Q2CC12TS
Dihydroorotate dehydrogenase (quinone), mitochondrial
(Homo sapiens (Human))
BDBM50212059
(CHEMBL3945267)
Show SMILES NCCO.COc1ccc2cc(CCc3c([nH]c(=O)[nH]c3=O)C(O)=O)c(OC)cc2c1
Show InChI InChI=1S/C19H18N2O6/c1-26-13-5-3-10-7-11(15(27-2)9-12(10)8-13)4-6-14-16(18(23)24)20-19(25)21-17(14)22/h3,5,7-9H,4,6H2,1-2H3,(H,23,24)(H2,20,21,22,25)
Reactome pathway
n/an/a 48n/an/an/an/an/an/a
Nagasaki University
Curated by ChEMBL
Assay Description
Inhibition of human dihydroorotate dehydrogenase assessed as reduction in orotate production using L-dihydroorotate as substrate measured after 20 mi...
Bioorg Med Chem 25: 1465-1470 (2017)
Article DOI: 10.1016/j.bmc.2017.01.009
BindingDB Entry DOI: 10.7270/Q2CC12TS