null
SMILES: CC(C)C(=O)N(CCCCc1nnn[nH]1)c1ccc(cc1)C(O)(C(F)(F)F)C(F)(F)F
InChI Key: InChIKey=ALXBZVHAMLWFLJ-UHFFFAOYSA-N
Activity Spreadsheet -- Enzyme Inhibition Constant Data from BindingDB
Found 2 hits for monomerid = 50212235
Trg + Lig
Ki
nM
ΔG°
kcal/mole
IC50
nM
Kd
nM
EC50/IC50
nM
koff
s-1
kon
M-1s-1
pHTemp
°C
Malonyl-CoA decarboxylase, mitochondrial
(Homo sapiens (Human))
BDBM50212235
(CHEMBL400455 | N-(4-(1H-tetrazol-5-yl)butyl)-N-(4-...)
Show SMILES CC(C)C(=O)N(CCCCc1nnn[nH]1)c1ccc(cc1)C(O)(C(F)(F)F)C(F)(F)F
Show InChI InChI=1S/C18H21F6N5O2/c1-11(2)15(30)29(10-4-3-5-14-25-27-28-26-14)13-8-6-12(7-9-13)16(31,17(19,20)21)18(22,23)24/h6-9,11,31H,3-5,10H2,1-2H3,(H,25,26,27,28)
Reactome pathway
n/an/a 8n/an/an/an/an/an/a
St. John's University
Curated by ChEMBL
Assay Description
Inhibition of human recombinant MCD
Bioorg Med Chem 15: 4470-81 (2007)
Article DOI: 10.1016/j.bmc.2007.04.025
BindingDB Entry DOI: 10.7270/Q2KH0N1C
Malonyl-CoA decarboxylase, mitochondrial
(Homo sapiens (Human))
BDBM50212235
(CHEMBL400455 | N-(4-(1H-tetrazol-5-yl)butyl)-N-(4-...)
Show SMILES CC(C)C(=O)N(CCCCc1nnn[nH]1)c1ccc(cc1)C(O)(C(F)(F)F)C(F)(F)F
Show InChI InChI=1S/C18H21F6N5O2/c1-11(2)15(30)29(10-4-3-5-14-25-27-28-26-14)13-8-6-12(7-9-13)16(31,17(19,20)21)18(22,23)24/h6-9,11,31H,3-5,10H2,1-2H3,(H,25,26,27,28)
Reactome pathway
n/an/a 8n/an/an/an/an/an/a
Chugai Pharma USA, LLC.
Curated by ChEMBL
Assay Description
Inhibition of MCD
J Med Chem 49: 1517-25 (2006)
Article DOI: 10.1021/jm050109n
BindingDB Entry DOI: 10.7270/Q2C828XZ