BDBM50212416 (1S,2S)-2-(3-(1-isopropyl-4,4,6-trimethyl-2-oxo-1,2,3,4-tetrahydroquinolin-7-yl)-4-(trifluoromethoxy)phenyl)cyclopropanecarboxylic acid::CHEMBL248414
SMILES: CC(C)N1C(=O)CC(C)(C)c2cc(C)c(cc12)-c1cc(ccc1OC(F)(F)F)[C@H]1C[C@@H]1C(O)=O
InChI Key: InChIKey=NFXPYYBQFZMOPD-MJGOQNOKSA-N
Data: 1 EC50
Activity Spreadsheet -- Enzyme Inhibition Constant Data from BindingDB
Found 1 hit for monomerid = 50212416
Trg + Lig
Ki
nM
ΔG°
kcal/mole
IC50
nM
Kd
nM
EC50/IC50
nM
koff
s-1
kon
M-1s-1
pHTemp
°C
Retinoic acid receptor RXR-alpha
(Homo sapiens (Human))
BDBM50212416
((1S,2S)-2-(3-(1-isopropyl-4,4,6-trimethyl-2-oxo-1,...)
Show SMILES CC(C)N1C(=O)CC(C)(C)c2cc(C)c(cc12)-c1cc(ccc1OC(F)(F)F)[C@H]1C[C@@H]1C(O)=O
Show InChI InChI=1S/C26H28F3NO4/c1-13(2)30-21-11-16(14(3)8-20(21)25(4,5)12-23(30)31)18-9-15(17-10-19(17)24(32)33)6-7-22(18)34-26(27,28)29/h6-9,11,13,17,19H,10,12H2,1-5H3,(H,32,33)/t17-,19+/m1/s1
NCI pathway
Reactome pathway
n/an/an/an/a 198n/an/an/an/a
Johnson and Johnson Pharmaceutical Research and Development
Curated by ChEMBL
Assay Description
Activity at RXRalpha by GAL4DNA cotransfection assay
Bioorg Med Chem Lett 17: 3491-6 (2007)
Article DOI: 10.1016/j.bmcl.2007.01.049
BindingDB Entry DOI: 10.7270/Q2T153B1