BDBM50212488 4'-{7-methoxy-6-[(2-pyrrolidin-1-yl-ethylamino)-methyl]-1,4-dihydro-indeno[1,2-c]pyrazol-3-yl}-biphenyl-4-ol::CHEMBL232810
SMILES: COc1cc-2c(Cc3c(n[nH]c-23)-c2ccc(cc2)-c2ccc(O)cc2)cc1CNCCN1CCCC1
InChI Key: InChIKey=CDACZKABGJCMSL-UHFFFAOYSA-N
Data: 1 IC50
Activity Spreadsheet -- Enzyme Inhibition Constant Data from BindingDB
Found 1 hit for monomerid = 50212488
Trg + Lig
Ki
nM
ΔG°
kcal/mole
IC50
nM
Kd
nM
EC50/IC50
nM
koff
s-1
kon
M-1s-1
pHTemp
°C
Serine/threonine-protein kinase Chk1
(Homo sapiens (Human))
BDBM50212488
(4'-{7-methoxy-6-[(2-pyrrolidin-1-yl-ethylamino)-me...)
Show SMILES COc1cc-2c(Cc3c(n[nH]c-23)-c2ccc(cc2)-c2ccc(O)cc2)cc1CNCCN1CCCC1
Show InChI InChI=1S/C30H32N4O2/c1-36-28-18-26-23(16-24(28)19-31-12-15-34-13-2-3-14-34)17-27-29(32-33-30(26)27)22-6-4-20(5-7-22)21-8-10-25(35)11-9-21/h4-11,16,18,31,35H,2-3,12-15,17,19H2,1H3,(H,32,33)
Reactome pathway
n/an/a 0.210n/an/an/an/an/an/a
Abbott Laboratories
Curated by ChEMBL
Assay Description
Inhibition of recombinant CHK-mediated Cdc25C phosphorylation after 30 mins
Bioorg Med Chem Lett 17: 3618-23 (2007)
Article DOI: 10.1016/j.bmcl.2007.04.055
BindingDB Entry DOI: 10.7270/Q2DR2V6Q