BDBM50212730 (R)-N-benzyl-2-(3-(2-(2-hydroxy-2-(4-hydroxy-3-(hydroxymethyl)phenyl)ethylamino)ethyl)phenyl)acetamide::CHEMBL230203
SMILES: OCc1cc(ccc1O)[C@@H](O)CNCCc1cccc(CC(=O)NCc2ccccc2)c1
InChI Key: InChIKey=CWTXUHVXNNFEPT-VWLOTQADSA-N
Data: 1 EC50
Activity Spreadsheet -- Enzyme Inhibition Constant Data from BindingDB
Found 1 hit for monomerid = 50212730
Trg + Lig
Ki
nM
ΔG°
kcal/mole
IC50
nM
Kd
nM
EC50/IC50
nM
koff
s-1
kon
M-1s-1
pHTemp
°C
Beta-2 adrenergic receptor
(Homo sapiens (Human))
BDBM50212730
((R)-N-benzyl-2-(3-(2-(2-hydroxy-2-(4-hydroxy-3-(hy...)
Show SMILES OCc1cc(ccc1O)[C@@H](O)CNCCc1cccc(CC(=O)NCc2ccccc2)c1
Show InChI InChI=1S/C26H30N2O4/c29-18-23-15-22(9-10-24(23)30)25(31)17-27-12-11-19-7-4-8-21(13-19)14-26(32)28-16-20-5-2-1-3-6-20/h1-10,13,15,25,27,29-31H,11-12,14,16-18H2,(H,28,32)/t25-/m0/s1
Reactome pathway
n/an/an/an/a 0.0960n/an/an/an/a
Pfizer Global Research and Development
Curated by ChEMBL
Assay Description
Agonist activity at human recombinant beta-2 adrenoceptor expressed in CHO cells assessed as elevation of cAMP
Bioorg Med Chem Lett 17: 4012-5 (2007)
Article DOI: 10.1016/j.bmcl.2007.04.081
BindingDB Entry DOI: 10.7270/Q2M909G9