BDBM50213132 (S)-N-(8-(hydroxyamino)-1,8-dioxo-1-(quinolin-6-ylamino)octan-2-yl)benzamide::CHEMBL246189
SMILES: ONC(=O)CCCCC[C@H](NC(=O)c1ccccc1)C(=O)Nc1ccc2ncccc2c1
InChI Key: InChIKey=ZQXBAARKUQXQTK-NRFANRHFSA-N
Data: 1 IC50
Activity Spreadsheet -- Enzyme Inhibition Constant Data from BindingDB
Found 1 hit for monomerid = 50213132
Trg + Lig
Ki
nM
ΔG°
kcal/mole
IC50
nM
Kd
nM
EC50/IC50
nM
koff
s-1
kon
M-1s-1
pHTemp
°C
Histone deacetylase 1
(Homo sapiens (Human))
BDBM50213132
((S)-N-(8-(hydroxyamino)-1,8-dioxo-1-(quinolin-6-yl...)
Show SMILES ONC(=O)CCCCC[C@H](NC(=O)c1ccccc1)C(=O)Nc1ccc2ncccc2c1
Show InChI InChI=1S/C24H26N4O4/c29-22(28-32)12-6-2-5-11-21(27-23(30)17-8-3-1-4-9-17)24(31)26-19-13-14-20-18(16-19)10-7-15-25-20/h1,3-4,7-10,13-16,21,32H,2,5-6,11-12H2,(H,26,31)(H,27,30)(H,28,29)/t21-/m0/s1
NCI pathway
Reactome pathway
n/an/a 3.5n/an/an/an/an/an/a
Merck Research Laboratories
Curated by ChEMBL
Assay Description
Inhibition of human HDAC 1
Bioorg Med Chem Lett 17: 3969-71 (2007)
Article DOI: 10.1016/j.bmcl.2007.04.089
BindingDB Entry DOI: 10.7270/Q2M908CJ