BDBM50213214 CHEMBL42139
SMILES: C1CN=C(Nc2ccc3OCCOc3c2)N1
InChI Key: InChIKey=CARQBUHFBAORAB-UHFFFAOYSA-N
Data: 2 KI  1 EC50
Activity Spreadsheet -- Enzyme Inhibition Constant Data from BindingDB
Found 3 hits for monomerid = 50213214
Trg + Lig
Ki
nM
ΔG°
kcal/mole
IC50
nM
Kd
nM
EC50/IC50
nM
koff
s-1
kon
M-1s-1
pHTemp
°C
Alpha-2A/Alpha-2B/Alpha-2C adrenergic receptor
(Homo sapiens (Human))
BDBM50213214
(CHEMBL42139)
Show SMILES C1CN=C(Nc2ccc3OCCOc3c2)N1 |t:2|
Show InChI InChI=1S/C11H13N3O2/c1-2-9-10(16-6-5-15-9)7-8(1)14-11-12-3-4-13-11/h1-2,7H,3-6H2,(H2,12,13,14)
3.10n/an/an/an/an/an/an/an/a
TBA
Assay Description
Binding affinity for Alpha-2 adrenergic receptor of CHO-C10 membrane preparation
Citation and Details
BindingDB Entry DOI: 10.7270/Q22J6F1V
Alpha-1A/Alpha-1B/Alpha-1D adrenergic receptor
(Homo sapiens (Human))
BDBM50213214
(CHEMBL42139)
Show SMILES C1CN=C(Nc2ccc3OCCOc3c2)N1 |t:2|
Show InChI InChI=1S/C11H13N3O2/c1-2-9-10(16-6-5-15-9)7-8(1)14-11-12-3-4-13-11/h1-2,7H,3-6H2,(H2,12,13,14)
2.40E+3n/an/an/an/an/an/an/an/a
TBA
Assay Description
Binding affinity for Alpha-1 adrenergic receptor of human cerebral cortex membrane
Citation and Details
BindingDB Entry DOI: 10.7270/Q22J6F1V
Alpha-2A/Alpha-2B/Alpha-2C adrenergic receptor
(Homo sapiens (Human))
BDBM50213214
(CHEMBL42139)
Show SMILES C1CN=C(Nc2ccc3OCCOc3c2)N1 |t:2|
Show InChI InChI=1S/C11H13N3O2/c1-2-9-10(16-6-5-15-9)7-8(1)14-11-12-3-4-13-11/h1-2,7H,3-6H2,(H2,12,13,14)
n/an/an/an/a 5.64E+4n/an/an/an/a
University of Dublin
Curated by ChEMBL
Assay Description
Agonist activity at human brain adrenergic alpha2 receptor by [35S]GTPgammaS binding assay
J Med Chem 50: 4516-27 (2007)
Article DOI: 10.1021/jm070229q
BindingDB Entry DOI: 10.7270/Q2571FSN