null
SMILES: [Na+].[H][C@]12[C@@H](C)C(Sc3nc4cc(CO)ccc4s3)=C(N1C(=O)[C@]2([H])[C@@H](C)O)C([O-])=O
InChI Key: InChIKey=GZYPCMPPJRFWKE-QEJJIEOJSA-M
Activity Spreadsheet -- Enzyme Inhibition Constant Data from BindingDB
Found 1 hit for monomerid = 50213220
Trg + Lig
Ki
nM
ΔG°
kcal/mole
IC50
nM
Kd
nM
EC50/IC50
nM
koff
s-1
kon
M-1s-1
pHTemp
°C
PBP2A
(Staphylococcus aureus)
BDBM50213220
(CHEMBL30322)
Show SMILES [Na+].[H][C@]12[C@@H](C)C(Sc3nc4cc(CO)ccc4s3)=C(N1C(=O)[C@]2([H])[C@@H](C)O)C([O-])=O |c:18|
Show InChI InChI=1S/C18H18N2O5S2/c1-7-13-12(8(2)22)16(23)20(13)14(17(24)25)15(7)27-18-19-10-5-9(6-21)3-4-11(10)26-18/h3-5,7-8,12-13,21-22H,6H2,1-2H3,(H,24,25)/p-1/t7-,8-,12-,13-/m1/s1
n/an/a 2.80E+3n/an/an/an/an/an/a
TBA
Assay Description
Binding affinity towards Penicillin-binding protein 2a from homogeneous MRSA COL strain using [3H]-radioligand
Citation and Details
BindingDB Entry DOI: 10.7270/Q26975R5