BDBM50214010 CHEMBL244165::N-(4-((1-(2-fluorobenzyl)-3-(cyclopropylmethyl)-2,6-dioxo-2,3,6,7-tetrahydro-1H-purin-8-yl)methyl)phenyl)acetamide::N-{4-[3-Cyclopropylmethyl-1-(2-fluoro-benzyl)-2,6-dioxo-2,3,6,7-tetrahydro-1H-purin-8-ylmethyl]-phenyl}-acetamide
SMILES: CC(=O)Nc1ccc(Cc2nc3n(CC4CC4)c(=O)n(Cc4ccccc4F)c(=O)c3[nH]2)cc1
InChI Key: InChIKey=LIIPHVVAEWIILY-UHFFFAOYSA-N
Data: 1 IC50  1 EC50
Activity Spreadsheet -- Enzyme Inhibition Constant Data from BindingDB
Found 2 hits for monomerid = 50214010
Trg + Lig
Ki
nM
ΔG°
kcal/mole
IC50
nM
Kd
nM
EC50/IC50
nM
koff
s-1
kon
M-1s-1
pHTemp
°C
Cytosolic phosphoenolpyruvate carboxykinase (cPEPCK)
(Rattus norvegicus (Rat))
BDBM50214010
(CHEMBL244165 | N-(4-((1-(2-fluorobenzyl)-3-(cyclop...)
Show SMILES CC(=O)Nc1ccc(Cc2nc3n(CC4CC4)c(=O)n(Cc4ccccc4F)c(=O)c3[nH]2)cc1
Show InChI InChI=1S/C25H24FN5O3/c1-15(32)27-19-10-8-16(9-11-19)12-21-28-22-23(29-21)30(13-17-6-7-17)25(34)31(24(22)33)14-18-4-2-3-5-20(18)26/h2-5,8-11,17H,6-7,12-14H2,1H3,(H,27,32)(H,28,29)
n/an/an/an/a 4.70E+3n/an/an/an/a
Roche Research Center
Curated by ChEMBL
Assay Description
Inhibition of cPEPCK in rat H4IIE cells assessed as effect on glucose production
Bioorg Med Chem Lett 17: 3835-9 (2007)
Article DOI: 10.1016/j.bmcl.2007.05.013
BindingDB Entry DOI: 10.7270/Q2BV7HF1
Phosphoenolpyruvate carboxykinase cytosolic
(Homo sapiens (Human))
BDBM50214010
(CHEMBL244165 | N-(4-((1-(2-fluorobenzyl)-3-(cyclop...)
Show SMILES CC(=O)Nc1ccc(Cc2nc3n(CC4CC4)c(=O)n(Cc4ccccc4F)c(=O)c3[nH]2)cc1
Show InChI InChI=1S/C25H24FN5O3/c1-15(32)27-19-10-8-16(9-11-19)12-21-28-22-23(29-21)30(13-17-6-7-17)25(34)31(24(22)33)14-18-4-2-3-5-20(18)26/h2-5,8-11,17H,6-7,12-14H2,1H3,(H,27,32)(H,28,29)
NCI pathway
Reactome pathway
n/an/a 690n/an/an/an/an/an/a
Roche Research Center
Curated by ChEMBL
Assay Description
Inhibition of human cPEPCK
Bioorg Med Chem Lett 17: 3835-9 (2007)
Article DOI: 10.1016/j.bmcl.2007.05.013
BindingDB Entry DOI: 10.7270/Q2BV7HF1