BDBM50214024 (1S,3S)-N1-(6-methoxy-4-methylquinolin-2-yl)-N3-(thiophen-3-ylmethyl)cyclohexane-1,3-diamine::CHEMBL400883
SMILES: COc1ccc2nc(N[C@H]3CCC[C@@H](C3)NCc3ccsc3)cc(C)c2c1
InChI Key: InChIKey=FELFFDCWHKHTBL-ROUUACIJSA-N
Data: 1 IC50
Activity Spreadsheet -- Enzyme Inhibition Constant Data from BindingDB
Found 1 hit for monomerid = 50214024
Trg + Lig
Ki
nM
ΔG°
kcal/mole
IC50
nM
Kd
nM
EC50/IC50
nM
koff
s-1
kon
M-1s-1
pHTemp
°C
Melanin-concentrating hormone receptor
(Homo sapiens (Human))
BDBM50214024
((1S,3S)-N1-(6-methoxy-4-methylquinolin-2-yl)-N3-(t...)
Show SMILES COc1ccc2nc(N[C@H]3CCC[C@@H](C3)NCc3ccsc3)cc(C)c2c1
Show InChI InChI=1S/C22H27N3OS/c1-15-10-22(25-21-7-6-19(26-2)12-20(15)21)24-18-5-3-4-17(11-18)23-13-16-8-9-27-14-16/h6-10,12,14,17-18,23H,3-5,11,13H2,1-2H3,(H,24,25)/t17-,18-/m0/s1
Reactome pathway
n/an/a 3n/an/an/an/an/an/a
AstraZeneca R&D Mölndal
Curated by ChEMBL
Assay Description
Displacement of [125I]MCH from human MCHR1 expressed in HEK293 cells
Bioorg Med Chem Lett 17: 4232-41 (2007)
Article DOI: 10.1016/j.bmcl.2007.05.034
BindingDB Entry DOI: 10.7270/Q27W6BVC