BDBM50214040 (1S,3S)-N1-(6-methoxy-4-methylquinolin-2-yl)-N3-(thiophen-3-ylmethyl)cyclopentane-1,3-diamine::CHEMBL250526
SMILES: COc1ccc2nc(N[C@H]3CC[C@@H](C3)NCc3ccsc3)cc(C)c2c1
InChI Key: InChIKey=UZSFFJFBSMDPNT-IRXDYDNUSA-N
Data: 1 IC50
Activity Spreadsheet -- Enzyme Inhibition Constant Data from BindingDB
Found 1 hit for monomerid = 50214040
Trg + Lig
Ki
nM
ΔG°
kcal/mole
IC50
nM
Kd
nM
EC50/IC50
nM
koff
s-1
kon
M-1s-1
pHTemp
°C
Melanin-concentrating hormone receptor
(Homo sapiens (Human))
BDBM50214040
((1S,3S)-N1-(6-methoxy-4-methylquinolin-2-yl)-N3-(t...)
Show SMILES COc1ccc2nc(N[C@H]3CC[C@@H](C3)NCc3ccsc3)cc(C)c2c1
Show InChI InChI=1S/C21H25N3OS/c1-14-9-21(24-20-6-5-18(25-2)11-19(14)20)23-17-4-3-16(10-17)22-12-15-7-8-26-13-15/h5-9,11,13,16-17,22H,3-4,10,12H2,1-2H3,(H,23,24)/t16-,17-/m0/s1
Reactome pathway
n/an/a 62n/an/an/an/an/an/a
AstraZeneca R&D Mölndal
Curated by ChEMBL
Assay Description
Displacement of [125I]MCH from human MCHR1 expressed in HEK293 cells
Bioorg Med Chem Lett 17: 4232-41 (2007)
Article DOI: 10.1016/j.bmcl.2007.05.034
BindingDB Entry DOI: 10.7270/Q27W6BVC