BDBM50214107 (5-(3-(4-(methoxymethyl)-1H-benzo[d]imidazol-2-yl)-1H-pyrazolo[3,4-b]pyridin-5-yl)pyridin-3-yl)-N-methylmethanamine::CHEMBL400749
SMILES: CNCc1cncc(c1)-c1cnc2n[nH]c(-c3nc4cccc(COC)c4[nH]3)c2c1
InChI Key: InChIKey=WLIGHAXZSXWZCO-UHFFFAOYSA-N
Data: 4 IC50
Activity Spreadsheet -- Enzyme Inhibition Constant Data from BindingDB
Found 4 hits for monomerid = 50214107
Trg + Lig
Ki
nM
ΔG°
kcal/mole
IC50
nM
Kd
nM
EC50/IC50
nM
koff
s-1
kon
M-1s-1
pHTemp
°C
Vascular endothelial growth factor receptor 2
(Homo sapiens (Human))
BDBM50214107
((5-(3-(4-(methoxymethyl)-1H-benzo[d]imidazol-2-yl)...)
Show SMILES CNCc1cncc(c1)-c1cnc2n[nH]c(-c3nc4cccc(COC)c4[nH]3)c2c1
Show InChI InChI=1S/C22H21N7O/c1-23-8-13-6-15(10-24-9-13)16-7-17-20(28-29-21(17)25-11-16)22-26-18-5-3-4-14(12-30-2)19(18)27-22/h3-7,9-11,23H,8,12H2,1-2H3,(H,26,27)(H,25,28,29)
NCI pathway
Reactome pathway
n/an/a 640n/an/an/an/an/an/a
Johnson & Johnson Pharmaceutical Research & Development L.L.C.
Curated by ChEMBL
Assay Description
Inhibition of VEGFR2
Bioorg Med Chem Lett 17: 4297-302 (2007)
Article DOI: 10.1016/j.bmcl.2007.05.029
BindingDB Entry DOI: 10.7270/Q20C4VGJ
Proto-oncogene tyrosine-protein kinase receptor Ret
(Homo sapiens (Human))
BDBM50214107
((5-(3-(4-(methoxymethyl)-1H-benzo[d]imidazol-2-yl)...)
Show SMILES CNCc1cncc(c1)-c1cnc2n[nH]c(-c3nc4cccc(COC)c4[nH]3)c2c1
Show InChI InChI=1S/C22H21N7O/c1-23-8-13-6-15(10-24-9-13)16-7-17-20(28-29-21(17)25-11-16)22-26-18-5-3-4-14(12-30-2)19(18)27-22/h3-7,9-11,23H,8,12H2,1-2H3,(H,26,27)(H,25,28,29)
n/an/a 1.00E+3n/an/an/an/an/an/a
Johnson & Johnson Pharmaceutical Research & Development L.L.C.
Curated by ChEMBL
Assay Description
Inhibition of RET
Bioorg Med Chem Lett 17: 4297-302 (2007)
Article DOI: 10.1016/j.bmcl.2007.05.029
BindingDB Entry DOI: 10.7270/Q20C4VGJ
Receptor tyrosine-protein kinase erbB-2
(Homo sapiens (Human))
BDBM50214107
((5-(3-(4-(methoxymethyl)-1H-benzo[d]imidazol-2-yl)...)
Show SMILES CNCc1cncc(c1)-c1cnc2n[nH]c(-c3nc4cccc(COC)c4[nH]3)c2c1
Show InChI InChI=1S/C22H21N7O/c1-23-8-13-6-15(10-24-9-13)16-7-17-20(28-29-21(17)25-11-16)22-26-18-5-3-4-14(12-30-2)19(18)27-22/h3-7,9-11,23H,8,12H2,1-2H3,(H,26,27)(H,25,28,29)
n/an/a>1.00E+5n/an/an/an/an/an/a
Johnson & Johnson Pharmaceutical Research & Development L.L.C.
Curated by ChEMBL
Assay Description
Inhibition of HER2
Bioorg Med Chem Lett 17: 4297-302 (2007)
Article DOI: 10.1016/j.bmcl.2007.05.029
BindingDB Entry DOI: 10.7270/Q20C4VGJ
Cyclin-dependent kinase 1
(Homo sapiens (Human))
BDBM50214107
((5-(3-(4-(methoxymethyl)-1H-benzo[d]imidazol-2-yl)...)
Show SMILES CNCc1cncc(c1)-c1cnc2n[nH]c(-c3nc4cccc(COC)c4[nH]3)c2c1
Show InChI InChI=1S/C22H21N7O/c1-23-8-13-6-15(10-24-9-13)16-7-17-20(28-29-21(17)25-11-16)22-26-18-5-3-4-14(12-30-2)19(18)27-22/h3-7,9-11,23H,8,12H2,1-2H3,(H,26,27)(H,25,28,29)
Reactome pathway
n/an/a 2.5n/an/an/an/an/an/a
Johnson & Johnson Pharmaceutical Research & Development L.L.C.
Curated by ChEMBL
Assay Description
Inhibition of CDK1
Bioorg Med Chem Lett 17: 4297-302 (2007)
Article DOI: 10.1016/j.bmcl.2007.05.029
BindingDB Entry DOI: 10.7270/Q20C4VGJ