BDBM50214262 (5R,8R,11S)-5-[(4-chlorophenyl)methyl]-11-[(methylamino)methyl]-8-(propan-2-yl)-3,4,5,6,7,8,9,10,11,12,13,14,15,16-tetradecahydro-2H-1,4,7,10,13-benzoxatetrazacyclooctadecine-6,9,12-trione::CHEMBL233560
SMILES: CNC[C@@H]1NC(=O)[C@H](NC(=O)[C@@H](Cc2ccc(Cl)cc2)NCCOc2ccccc2CCCNC1=O)C(C)C
InChI Key: InChIKey=PLHRYBWQMPIXPZ-RMTZWNOUSA-N
Data: 1 KI  1 IC50
Activity Spreadsheet -- Enzyme Inhibition Constant Data from BindingDB
Found 2 hits for monomerid = 50214262
Trg + Lig
Ki
nM
ΔG°
kcal/mole
IC50
nM
Kd
nM
EC50/IC50
nM
koff
s-1
kon
M-1s-1
pHTemp
°C
Motilin receptor
(Homo sapiens (Human))
BDBM50214262
((5R,8R,11S)-5-[(4-chlorophenyl)methyl]-11-[(methyl...)
Show SMILES CNC[C@@H]1NC(=O)[C@H](NC(=O)[C@@H](Cc2ccc(Cl)cc2)NCCOc2ccccc2CCCNC1=O)C(C)C
Show InChI InChI=1S/C29H40ClN5O4/c1-19(2)26-29(38)34-24(18-31-3)27(36)33-14-6-8-21-7-4-5-9-25(21)39-16-15-32-23(28(37)35-26)17-20-10-12-22(30)13-11-20/h4-5,7,9-13,19,23-24,26,31-32H,6,8,14-18H2,1-3H3,(H,33,36)(H,34,38)(H,35,37)/t23-,24+,26-/m1/s1
Reactome pathway
31n/an/an/an/an/an/an/an/a
Tranzyme Pharma Inc.
Curated by ChEMBL
Assay Description
Displacement of [125I]-motilin from human motilin receptor expressed in CHO cells
Bioorg Med Chem Lett 17: 4187-90 (2007)
Article DOI: 10.1016/j.bmcl.2007.05.043
BindingDB Entry DOI: 10.7270/Q2GF0T62
Motilin receptor
(Homo sapiens (Human))
BDBM50214262
((5R,8R,11S)-5-[(4-chlorophenyl)methyl]-11-[(methyl...)
Show SMILES CNC[C@@H]1NC(=O)[C@H](NC(=O)[C@@H](Cc2ccc(Cl)cc2)NCCOc2ccccc2CCCNC1=O)C(C)C
Show InChI InChI=1S/C29H40ClN5O4/c1-19(2)26-29(38)34-24(18-31-3)27(36)33-14-6-8-21-7-4-5-9-25(21)39-16-15-32-23(28(37)35-26)17-20-10-12-22(30)13-11-20/h4-5,7,9-13,19,23-24,26,31-32H,6,8,14-18H2,1-3H3,(H,33,36)(H,34,38)(H,35,37)/t23-,24+,26-/m1/s1
Reactome pathway
n/an/a 33n/an/an/an/an/an/a
Tranzyme Pharma Inc.
Curated by ChEMBL
Assay Description
Antagonist activity against human motilin receptor in aequoscreen cells assessed as inhibition of motilin induced calcium release by aequorin assay
Bioorg Med Chem Lett 17: 4187-90 (2007)
Article DOI: 10.1016/j.bmcl.2007.05.043
BindingDB Entry DOI: 10.7270/Q2GF0T62