null
SMILES: CN(C)c1ccc(NC(=O)NCCCCCCC(=O)NO)cc1
InChI Key: InChIKey=ZYOHRYKXMFPCNU-UHFFFAOYSA-N
Activity Spreadsheet -- Enzyme Inhibition Constant Data from BindingDB
Found 5 hits for monomerid = 50214433
Trg + Lig
Ki
nM
ΔG°
kcal/mole
IC50
nM
Kd
nM
EC50/IC50
nM
koff
s-1
kon
M-1s-1
pHTemp
°C
Histone deacetylase 2
(Homo sapiens (Human))
BDBM50214433
(1-(4-(dimethylamino)phenyl)-3-(7-(hydroxyamino)-7-...)
Show SMILES CN(C)c1ccc(NC(=O)NCCCCCCC(=O)NO)cc1
Show InChI InChI=1S/C16H26N4O3/c1-20(2)14-10-8-13(9-11-14)18-16(22)17-12-6-4-3-5-7-15(21)19-23/h8-11,23H,3-7,12H2,1-2H3,(H,19,21)(H2,17,18,22)
NCI pathway
Reactome pathway
n/an/a 647n/an/an/an/an/an/a
University of Illinois at Chicago
Curated by ChEMBL
Assay Description
Inhibition of His-tagged HDAC2 expressed in Sf9 cells by fluorescence-based assay
J Med Chem 50: 3054-61 (2007)
Article DOI: 10.1021/jm070178x
BindingDB Entry DOI: 10.7270/Q26W99SW
Histone deacetylase 8
(Homo sapiens (Human))
BDBM50214433
(1-(4-(dimethylamino)phenyl)-3-(7-(hydroxyamino)-7-...)
Show SMILES CN(C)c1ccc(NC(=O)NCCCCCCC(=O)NO)cc1
Show InChI InChI=1S/C16H26N4O3/c1-20(2)14-10-8-13(9-11-14)18-16(22)17-12-6-4-3-5-7-15(21)19-23/h8-11,23H,3-7,12H2,1-2H3,(H,19,21)(H2,17,18,22)
NCI pathway
Reactome pathway
n/an/a 1.74E+3n/an/an/an/an/an/a
University of Illinois at Chicago
Curated by ChEMBL
Assay Description
Inhibition of His-tagged HDAC8 expressed in Sf9 cells by fluorescence-based assay
J Med Chem 50: 3054-61 (2007)
Article DOI: 10.1021/jm070178x
BindingDB Entry DOI: 10.7270/Q26W99SW
Histone deacetylase 6
(Homo sapiens (Human))
BDBM50214433
(1-(4-(dimethylamino)phenyl)-3-(7-(hydroxyamino)-7-...)
Show SMILES CN(C)c1ccc(NC(=O)NCCCCCCC(=O)NO)cc1
Show InChI InChI=1S/C16H26N4O3/c1-20(2)14-10-8-13(9-11-14)18-16(22)17-12-6-4-3-5-7-15(21)19-23/h8-11,23H,3-7,12H2,1-2H3,(H,19,21)(H2,17,18,22)
NCI pathway
Reactome pathway
n/an/a 34.5n/an/an/an/an/an/a
University of Illinois at Chicago
Curated by ChEMBL
Assay Description
Inhibition of His-tagged HDAC6 expressed in Sf9 cells by fluorescence-based assay
J Med Chem 50: 3054-61 (2007)
Article DOI: 10.1021/jm070178x
BindingDB Entry DOI: 10.7270/Q26W99SW
Histone deacetylase 1
(Homo sapiens (Human))
BDBM50214433
(1-(4-(dimethylamino)phenyl)-3-(7-(hydroxyamino)-7-...)
Show SMILES CN(C)c1ccc(NC(=O)NCCCCCCC(=O)NO)cc1
Show InChI InChI=1S/C16H26N4O3/c1-20(2)14-10-8-13(9-11-14)18-16(22)17-12-6-4-3-5-7-15(21)19-23/h8-11,23H,3-7,12H2,1-2H3,(H,19,21)(H2,17,18,22)
NCI pathway
Reactome pathway
n/an/a 209n/an/an/an/an/an/a
University of Illinois at Chicago
Curated by ChEMBL
Assay Description
Inhibition of His-tagged HDAC1 expressed in Sf9 cells by fluorescence-based assay
J Med Chem 50: 3054-61 (2007)
Article DOI: 10.1021/jm070178x
BindingDB Entry DOI: 10.7270/Q26W99SW
Polyamine deacetylase HDAC10
(Homo sapiens (Human))
BDBM50214433
(1-(4-(dimethylamino)phenyl)-3-(7-(hydroxyamino)-7-...)
Show SMILES CN(C)c1ccc(NC(=O)NCCCCCCC(=O)NO)cc1
Show InChI InChI=1S/C16H26N4O3/c1-20(2)14-10-8-13(9-11-14)18-16(22)17-12-6-4-3-5-7-15(21)19-23/h8-11,23H,3-7,12H2,1-2H3,(H,19,21)(H2,17,18,22)
NCI pathway
Reactome pathway
n/an/a 176n/an/an/an/an/an/a
University of Illinois at Chicago
Curated by ChEMBL
Assay Description
Inhibition of His-tagged HDAC10 expressed in Sf9 cells by fluorescence-based assay
J Med Chem 50: 3054-61 (2007)
Article DOI: 10.1021/jm070178x
BindingDB Entry DOI: 10.7270/Q26W99SW