null
SMILES: COc1c(O)ccc2O\C(=C/c3ccc(OC(F)(F)F)cc3)C3=C(C=CC4NC(C)(C)C=C(C)C34)c12
InChI Key: InChIKey=KTNJFMQBWXWIKW-XKZIYDEJSA-N
Activity Spreadsheet -- Enzyme Inhibition Constant Data from BindingDB
Found 4 hits for monomerid = 50214924
Trg + Lig
Ki
nM
ΔG°
kcal/mole
IC50
nM
Kd
nM
EC50/IC50
nM
koff
s-1
kon
M-1s-1
pHTemp
°C
Glucocorticoid receptor
(Homo sapiens (Human))
BDBM50214924
((Z)-5-(4-(trifluoromethoxy)benzylidene)-10-methoxy...)
Show SMILES COc1c(O)ccc2O\C(=C/c3ccc(OC(F)(F)F)cc3)C3=C(C=CC4NC(C)(C)C=C(C)C34)c12 |w:26.26,34.35,c:25,t:23,32|
Show InChI InChI=1S/C28H26F3NO4/c1-15-14-27(2,3)32-19-10-9-18-24(23(15)19)22(35-21-12-11-20(33)26(34-4)25(18)21)13-16-5-7-17(8-6-16)36-28(29,30)31/h5-14,19,23,32-33H,1-4H3/b22-13-
4.30n/an/an/an/an/an/an/an/a
Ligand Pharmaceuticals
Curated by ChEMBL
Assay Description
Displacement of radiolabeled dexamethasone from glucocorticoid receptor
Bioorg Med Chem Lett 17: 4158-62 (2007)
Article DOI: 10.1016/j.bmcl.2007.05.062
BindingDB Entry DOI: 10.7270/Q2DF6QXW
Glucocorticoid receptor
(Homo sapiens (Human))
BDBM50214924
((Z)-5-(4-(trifluoromethoxy)benzylidene)-10-methoxy...)
Show SMILES COc1c(O)ccc2O\C(=C/c3ccc(OC(F)(F)F)cc3)C3=C(C=CC4NC(C)(C)C=C(C)C34)c12 |w:26.26,34.35,c:25,t:23,32|
Show InChI InChI=1S/C28H26F3NO4/c1-15-14-27(2,3)32-19-10-9-18-24(23(15)19)22(35-21-12-11-20(33)26(34-4)25(18)21)13-16-5-7-17(8-6-16)36-28(29,30)31/h5-14,19,23,32-33H,1-4H3/b22-13-
n/an/an/an/a 437n/an/an/an/a
Ligand Pharmaceuticals
Curated by ChEMBL
Assay Description
Agonist activity at GR by GRE activation assay
Bioorg Med Chem Lett 17: 4158-62 (2007)
Article DOI: 10.1016/j.bmcl.2007.05.062
BindingDB Entry DOI: 10.7270/Q2DF6QXW
Glucocorticoid receptor
(Homo sapiens (Human))
BDBM50214924
((Z)-5-(4-(trifluoromethoxy)benzylidene)-10-methoxy...)
Show SMILES COc1c(O)ccc2O\C(=C/c3ccc(OC(F)(F)F)cc3)C3=C(C=CC4NC(C)(C)C=C(C)C34)c12 |w:26.26,34.35,c:25,t:23,32|
Show InChI InChI=1S/C28H26F3NO4/c1-15-14-27(2,3)32-19-10-9-18-24(23(15)19)22(35-21-12-11-20(33)26(34-4)25(18)21)13-16-5-7-17(8-6-16)36-28(29,30)31/h5-14,19,23,32-33H,1-4H3/b22-13-
n/an/a 91n/an/an/an/an/an/a
Ligand Pharmaceuticals
Curated by ChEMBL
Assay Description
Activity at GR assessed as repression of TNFalpha and IL 1beta induced E-selectin response
Bioorg Med Chem Lett 17: 4158-62 (2007)
Article DOI: 10.1016/j.bmcl.2007.05.062
BindingDB Entry DOI: 10.7270/Q2DF6QXW
Glucocorticoid receptor
(Homo sapiens (Human))
BDBM50214924
((Z)-5-(4-(trifluoromethoxy)benzylidene)-10-methoxy...)
Show SMILES COc1c(O)ccc2O\C(=C/c3ccc(OC(F)(F)F)cc3)C3=C(C=CC4NC(C)(C)C=C(C)C34)c12 |w:26.26,34.35,c:25,t:23,32|
Show InChI InChI=1S/C28H26F3NO4/c1-15-14-27(2,3)32-19-10-9-18-24(23(15)19)22(35-21-12-11-20(33)26(34-4)25(18)21)13-16-5-7-17(8-6-16)36-28(29,30)31/h5-14,19,23,32-33H,1-4H3/b22-13-
n/an/an/an/a>1.00E+3n/an/an/an/a
Ligand Pharmaceuticals
Curated by ChEMBL
Assay Description
Antagonist activity at GR assessed as inhibition of dexamethasone-induced GRE activation
Bioorg Med Chem Lett 17: 4158-62 (2007)
Article DOI: 10.1016/j.bmcl.2007.05.062
BindingDB Entry DOI: 10.7270/Q2DF6QXW