null
SMILES: Cc1cn(Cc2ccc(cc2)C(O)=O)c2cc(ccc12)C(=O)Nc1c(Cl)c[n+]([O-])cc1Cl
InChI Key: InChIKey=HGNNCCDNQVJZKO-UHFFFAOYSA-N
Activity Spreadsheet -- Enzyme Inhibition Constant Data from BindingDB
Found 2 hits for monomerid = 50215121
Trg + Lig
Ki
nM
ΔG°
kcal/mole
IC50
nM
Kd
nM
EC50/IC50
nM
koff
s-1
kon
M-1s-1
pHTemp
°C
cAMP-specific 3',5'-cyclic phosphodiesterase 4A/4B/4C/4D
(Homo sapiens (Human))
BDBM50215121
(CHEMBL102020)
Show SMILES Cc1cn(Cc2ccc(cc2)C(O)=O)c2cc(ccc12)C(=O)Nc1c(Cl)c[n+]([O-])cc1Cl
Show InChI InChI=1S/C23H17Cl2N3O4/c1-13-9-27(10-14-2-4-15(5-3-14)23(30)31)20-8-16(6-7-17(13)20)22(29)26-21-18(24)11-28(32)12-19(21)25/h2-9,11-12H,10H2,1H3,(H,26,29)(H,30,31)
3.18E+3n/an/an/an/an/an/an/an/a
Rh£ne-Poulenc Rorer Central Research
Curated by ChEMBL
Assay Description
Affinity for rolipram binding site of phosphodiesterase type IV (PDE4)
Bioorg Med Chem Lett 8: 3053-8 (1998)
BindingDB Entry DOI: 10.7270/Q2PV6NK6
cAMP-specific 3',5'-cyclic phosphodiesterase 4A/4B/4C/4D
(Homo sapiens (Human))
BDBM50215121
(CHEMBL102020)
Show SMILES Cc1cn(Cc2ccc(cc2)C(O)=O)c2cc(ccc12)C(=O)Nc1c(Cl)c[n+]([O-])cc1Cl
Show InChI InChI=1S/C23H17Cl2N3O4/c1-13-9-27(10-14-2-4-15(5-3-14)23(30)31)20-8-16(6-7-17(13)20)22(29)26-21-18(24)11-28(32)12-19(21)25/h2-9,11-12H,10H2,1H3,(H,26,29)(H,30,31)
n/an/a 1.40E+3n/an/an/an/an/an/a
Rh£ne-Poulenc Rorer Central Research
Curated by ChEMBL
Assay Description
Inhibition of phosphodiesterase type IV (PDE4) activity
Bioorg Med Chem Lett 8: 3053-8 (1998)
BindingDB Entry DOI: 10.7270/Q2PV6NK6