null
SMILES: Cc1c(Cl)cc2[nH]c(=O)c(=O)[nH]c2c1N(CC(O)=O)S(C)(=O)=O
InChI Key: InChIKey=LWEKKTGHNHMKQC-UHFFFAOYSA-N
Activity Spreadsheet -- Enzyme Inhibition Constant Data from BindingDB
Found 1 hit for monomerid = 50215284
Trg + Lig
Ki
nM
ΔG°
kcal/mole
IC50
nM
Kd
nM
EC50/IC50
nM
koff
s-1
kon
M-1s-1
pHTemp
°C
Glutamate receptor ionotropic, NMDA 1
(Homo sapiens (Human))
BDBM50215284
(2-(N-(7-chloro-6-methyl-2,3-dioxo-1,2,3,4-tetrahyd...)
Show SMILES Cc1c(Cl)cc2[nH]c(=O)c(=O)[nH]c2c1N(CC(O)=O)S(C)(=O)=O
Show InChI InChI=1S/C12H12ClN3O6S/c1-5-6(13)3-7-9(15-12(20)11(19)14-7)10(5)16(4-8(17)18)23(2,21)22/h3H,4H2,1-2H3,(H,14,19)(H,15,20)(H,17,18)
n/an/a 2n/an/an/an/an/an/a
Pfizer Global Research and Development
Curated by ChEMBL
Assay Description
Antagonist activity at human NMDA NR1 receptor
Bioorg Med Chem Lett 17: 4599-603 (2007)
Article DOI: 10.1016/j.bmcl.2007.05.083
BindingDB Entry DOI: 10.7270/Q2QR4WTR