BDBM50215397 CHEMBL173523
SMILES: CCC(CC)(CC(=O)Nc1cccc(OCc2ccc3ccc(cc3n2)C(F)(F)F)c1)C(O)=O
InChI Key: InChIKey=UKECUOUDZYOQPY-UHFFFAOYSA-N
Data: 1 IC50
Activity Spreadsheet -- Enzyme Inhibition Constant Data from BindingDB
Found 1 hit for monomerid = 50215397
Trg + Lig
Ki
nM
ΔG°
kcal/mole
IC50
nM
Kd
nM
EC50/IC50
nM
koff
s-1
kon
M-1s-1
pHTemp
°C
Cysteinyl leukotriene receptor
(Homo sapiens (Human))
BDBM50215397
(CHEMBL173523)
Show SMILES CCC(CC)(CC(=O)Nc1cccc(OCc2ccc3ccc(cc3n2)C(F)(F)F)c1)C(O)=O
Show InChI InChI=1S/C25H25F3N2O4/c1-3-24(4-2,23(32)33)14-22(31)30-18-6-5-7-20(13-18)34-15-19-11-9-16-8-10-17(25(26,27)28)12-21(16)29-19/h5-13H,3-4,14-15H2,1-2H3,(H,30,31)(H,32,33)
n/an/a 3n/an/an/an/an/an/a
Novartis Pharma AG
Curated by ChEMBL
Assay Description
In vitro for antagonistic activity against LTD4 receptor in guinea pig ileum
Bioorg Med Chem Lett 8: 965-70 (1999)
BindingDB Entry DOI: 10.7270/Q2V123XT