BDBM50215494 3-((dimethylamino)methyl)-6-methoxy-2,3,4,9-tetrahydro-1H-pyrido[3,4-b]indole-1-carboxylic acid::CHEMBL245461
SMILES: COc1ccc2[nH]c3C(NC(CN(C)C)Cc3c2c1)C(O)=O
InChI Key: InChIKey=MESXODUBVZGQCV-UHFFFAOYSA-N
Data: 1 IC50
Activity Spreadsheet -- Enzyme Inhibition Constant Data from BindingDB
Found 1 hit for monomerid = 50215494
Trg + Lig
Ki
nM
ΔG°
kcal/mole
IC50
nM
Kd
nM
EC50/IC50
nM
koff
s-1
kon
M-1s-1
pHTemp
°C
MAP kinase-activated protein kinase 2
(Homo sapiens (Human))
BDBM50215494
(3-((dimethylamino)methyl)-6-methoxy-2,3,4,9-tetrah...)
Show SMILES COc1ccc2[nH]c3C(NC(CN(C)C)Cc3c2c1)C(O)=O |w:8.21,10.10|
Show InChI InChI=1S/C16H21N3O3/c1-19(2)8-9-6-12-11-7-10(22-3)4-5-13(11)18-14(12)15(17-9)16(20)21/h4-5,7,9,15,17-18H,6,8H2,1-3H3,(H,20,21)
NCI pathway
Reactome pathway
n/an/a>2.00E+5n/an/an/an/an/an/a
Pfizer Global Research and Development
Curated by ChEMBL
Assay Description
Inhibition of MK2
Bioorg Med Chem Lett 17: 4657-63 (2007)
Article DOI: 10.1016/j.bmcl.2007.05.070
BindingDB Entry DOI: 10.7270/Q2PR7VPC