BDBM50215498 CHEMBL395132::methyl 6-methoxy-2,3,4,9-tetrahydro-1H-pyrido[3,4-b]indole-1-carboxylate
SMILES: COC(=O)C1NCCc2c1[nH]c1ccc(OC)cc21
InChI Key: InChIKey=SJRIQOGRDDWTOZ-UHFFFAOYSA-N
Data: 1 IC50
Activity Spreadsheet -- Enzyme Inhibition Constant Data from BindingDB
Found 1 hit for monomerid = 50215498
Trg + Lig
Ki
nM
ΔG°
kcal/mole
IC50
nM
Kd
nM
EC50/IC50
nM
koff
s-1
kon
M-1s-1
pHTemp
°C
MAP kinase-activated protein kinase 2
(Homo sapiens (Human))
BDBM50215498
(CHEMBL395132 | methyl 6-methoxy-2,3,4,9-tetrahydro...)
Show SMILES COC(=O)C1NCCc2c1[nH]c1ccc(OC)cc21 |w:4.3|
Show InChI InChI=1S/C14H16N2O3/c1-18-8-3-4-11-10(7-8)9-5-6-15-13(12(9)16-11)14(17)19-2/h3-4,7,13,15-16H,5-6H2,1-2H3
NCI pathway
Reactome pathway
n/an/a 4.70E+4n/an/an/an/an/an/a
Pfizer Global Research and Development
Curated by ChEMBL
Assay Description
Inhibition of MK2
Bioorg Med Chem Lett 17: 4657-63 (2007)
Article DOI: 10.1016/j.bmcl.2007.05.070
BindingDB Entry DOI: 10.7270/Q2PR7VPC