BDBM50215527 2-isopropyl-6-methoxy-2,3,4,9-tetrahydro-1H-pyrido[3,4-b]indole-1-carboxylic acid::CHEMBL437766
SMILES: COc1ccc2[nH]c3C(N(CCc3c2c1)C(C)C)C(O)=O
InChI Key: InChIKey=XXOITNYOVMAEAC-UHFFFAOYSA-N
Data: 1 IC50
Activity Spreadsheet -- Enzyme Inhibition Constant Data from BindingDB
Found 1 hit for monomerid = 50215527
Trg + Lig
Ki
nM
ΔG°
kcal/mole
IC50
nM
Kd
nM
EC50/IC50
nM
koff
s-1
kon
M-1s-1
pHTemp
°C
MAP kinase-activated protein kinase 2
(Homo sapiens (Human))
BDBM50215527
(2-isopropyl-6-methoxy-2,3,4,9-tetrahydro-1H-pyrido...)
Show SMILES COc1ccc2[nH]c3C(N(CCc3c2c1)C(C)C)C(O)=O |w:8.20|
Show InChI InChI=1S/C16H20N2O3/c1-9(2)18-7-6-11-12-8-10(21-3)4-5-13(12)17-14(11)15(18)16(19)20/h4-5,8-9,15,17H,6-7H2,1-3H3,(H,19,20)
NCI pathway
Reactome pathway
n/an/a 1.70E+5n/an/an/an/an/an/a
Pfizer Global Research and Development
Curated by ChEMBL
Assay Description
Inhibition of MK2
Bioorg Med Chem Lett 17: 4657-63 (2007)
Article DOI: 10.1016/j.bmcl.2007.05.070
BindingDB Entry DOI: 10.7270/Q2PR7VPC